{"text_format":"1","workbook":"xlsx","n_sheets":17,"sheets":["Załącznik 13-F.O. Zad 11-15 ","zadanie 11-12","Zadanie13","Zadanie14","Zadanie15","Załącznik14-F.O. dla Zadania 11","Załącznik15-F.O. dla Zadania 12","Załącznik16-F.O. dla Zadania 13","Załącznik17-F.O. dla Zadanie 14","Załącznik18-F.O. dla Zadania 15","zad1","zad2","zad3","zad4","zad5","zad6","zad7"],"not_rendered":{"charts":0,"images":5,"macros":1,"external_links":0,"defined_names":6,"comments":0,"pivot_tables":0},"unopened":[],"bounds":{"document_bytes":16777216,"sheet_cells":100000,"rows_first":2000,"rows_last":500,"rows_between":2000,"halvings":0,"cell_chars":16384,"cell_head_chars":4096},"cells_cut":0,"cells_raw":0,"read":"whole","date_system":"1900"}

{"sheet":"Załącznik 13-F.O. Zad 11-15 ","index":0,"n_rows":178,"n_cols":22,"rows_kept":178,"cut":false,"hidden":false,"merged":[[176,1,176,2],[177,1,177,2],[177,3,177,4],[18,3,18,6],[19,3,19,6],[21,3,21,6],[22,3,22,6],[2,2,2,6],[4,2,4,6],[8,2,8,6],[11,2,11,6],[14,2,14,6],[53,9,53,10],[24,3,24,6],[40,2,40,6],[36,3,36,6],[37,3,37,6],[33,3,33,6],[34,3,34,6],[25,3,25,6],[27,3,27,6],[28,3,28,6],[30,3,30,6],[31,3,31,6],[42,2,44,6],[41,2,41,6]]}
[null,null,"Oznaczenie sprawy:  1400/DW00/ZU/KZ/2022/0000079539"]
[]
[null,null,"ZAŁĄCZNIK NR 13 - FORMULARZ OFERTY DLA ZADAŃ: OD 11 DO 15"]
[]
[]
[null,null,null,"(pieczęć wykonawcy)"]
[]
[null,null,"Ja, niżej podpisany (My niżej podpisani):"]
[]
[]
[null,null,"działając w imieniu i na rzecz:"]
[]
[]
[null,null,"Składam(y) ofertę na wykonanie zamówienia, którego przedmiotem jest:"]
[null,null,"Dostawa artykułów biurowych, spożywczych i higienicznych dla spółek GK ENEA"]
[]
[null,null,"Oferujemy wykonanie zamówienia zgodnie z opisem przedmiotu zamówienia:"]
[]
[null,null,"ŁĄCZNA CENA NETTO OFERTY DLA ZADANIA 11",{"$f":"IF(V55=TRUE,K55,\"Wykonawca nie składa oferty\")","v":"Wykonawca nie składa oferty"}]
[null,null,"CENA NETTO SŁOWNIE: ",{"$f":"IF(V55=TRUE,zad1!E13,\"\")","v":""}]
[]
[null,null,"ŁĄCZNA CENA NETTO OFERTY DLA ZADANIA 12",{"$f":"IF(V56=TRUE,K56,\"Wykonawca nie składa oferty\")","v":"Wykonawca nie składa oferty"}]
[null,null,"CENA NETTO SŁOWNIE: ",{"$f":"IF(V55=TRUE,zad2!E13,\"\")","v":""}]
[]
[null,null,"ŁĄCZNA CENA NETTO OFERTY DLA ZADANIA 13",{"$f":"IF(V57=TRUE,K57,\"Wykonawca nie składa oferty\")","v":"Wykonawca nie składa oferty"}]
[null,null,"CENA NETTO SŁOWNIE: ",{"$f":"IF(V55=TRUE,zad3!E13,\"\")","v":""}]
[]
[null,null,"ŁĄCZNA CENA NETTO OFERTY DLA ZADANIA 14",{"$f":"IF(V58=TRUE,K58,\"Wykonawca nie składa oferty\")","v":"Wykonawca nie składa oferty"}]
[null,null,"CENA NETTO SŁOWNIE: ",{"$f":"IF(V55=TRUE,zad4!E13,\"\")","v":""}]
[]
[null,null,"ŁĄCZNA CENA NETTO OFERTY DLA ZADANIA 15",{"$f":"IF(V59=TRUE,K59,\"Wykonawca nie składa oferty\")","v":"Wykonawca nie składa oferty"}]
[null,null,"CENA NETTO SŁOWNIE: ",{"$f":"IF(V55=TRUE,zad5!E13,\"\")","v":""}]
[]
[]
[]
[]
[]
[]
[]
[]
[null,null,"INSTRUKCJA DLA WYKONAWCY: \n\n1.Wykonawca w załączniku \"FORMULARZ OFERTY DLA ZADAŃ: OD 11 DO 15\" uzupełnia ceny jednostkowe netto oraz stawki vat dla wszystkich produktów (kolumna \"F\" i \"G\" Wiersze od 53).  \n2. Ceny jednostkowe netto wpisane w arkuszu \"FORMULARZ OFERTY DLA ZADAŃ: OD 11 DO 15\" zaciągają się do kolejnych arkuszy Zadań i wyliczają wartość oferty.\n3. Cena netto Oferty dla danego Zadania (łącznie z cenami jednostkowymi netto) musi być podana w złotych polskich, z dokładnością do dwóch miejsc po przecinku poprzez zastosowanie w arkuszu kalkulacyjnym excel funkcji zaokrąglenia. tj. ZAOKR (=ZAOKR(A1;2), gdzie A1 oznacza liczbę). \n4. Cena Oferty netto dla danego Zadania, w tym ceny jednostkowe netto, muszą być wyższe niż  0,00 PLN.\n"]
[null,null,"Uwaga: na niebiesko zostały zaznaczone pola do uzupełnienia przez Wykonawców (załączniki: \"FORMULARZ OFERTY DLA ZADAŃ: OD 11 DO 15\" oraz Załączniki dla Zadania od 11 do 15). "]
[null,null,"W celu złożenia oferty Wykonawca zobowiązany jest do uzupełnienia i podpisania arkusza: \"FORMULARZ OFERTY DLA ZADAŃ: OD 11 DO 15\" oraz uzupełnienia i podpisania załączników dla wszystkich Zadań, na które składa Ofertę, np. Wykonawca składając ofertę dla Zadania 11 i Zadania 15 powinien złożyć wypełniony i podpisany załącznik: \"FORMULARZ OFERTY DLA ZADAŃ: OD 11 DO 15\" (wypełniony zgodnie z powyższa instrukcją) oraz Załącznik nr 14 dla Zadanie 11 i Załącznik nr 18 dla Zadanie 15 (należy wypełnić tylko pola oznaczone na niebiesko)."]
[]
[]
[]
[]
[]
[]
[]
[]
[null,"lp","Opis","Opis szczegółowy","Jednostka ","Stawka VAT","Cena jednostkowa netto","numer katalogowy"]
[null,1,"Filtr do expresu DELONGHI 45.76X","Filtr do expresu DELONGHI 45.76X","szt",null,null,null,null,"Wartość łączna oferty netto",{"$f":"SUM(K55:K61)","v":0}]
[null,2,"ODKAMIENIACZ DO EKSPRESU MELITTA 250ML","odkamieniacz do  ekspresu MELITA poj. 250 ml.","szt. (250 ml)",null,null,null,null,"Zaznacz zadanie/zadania na które składana jest oferta:"]
[null,3,"Odkamieniacz KAMIX, w proszku, 150 g","Środek do usuwania osadów z kamienia Pojemność: 150 g Jednostka sprzedaży: 1 opakowanie ","op. ( 150 g)",null,null,null,null,null,{"$f":"IF(V55=TRUE,'Załącznik14-F.O. dla Zadania 11'!D19,0)","v":0},null,null,null,null,null,null,null,null,null,null,false]
[null,4,"Odkamieniacz uniwersalny KAMIX, w płynie, 500 ml","Środek w płynie do usuwania osadów kamienia Pojemność: 500 ml Jednostka sprzedaży: 1 opakowanie ","op. (500 ml)",null,null,null,null,null,{"$f":"IF(V56=TRUE,'Załącznik15-F.O. dla Zadania 12'!D19,0)","v":0},null,null,null,null,null,null,null,null,null,null,false]
[null,5,"Tabletki do czyszczenia sekcji mlecznej ekspresu","Tabletki do codziennego czyszczenia sekcji mlecznej zapewniają dokładne i higieniczne użytkowanie sekcji mlecznej Jednostka sprzedaży: 1 opakowanie","op. ( 62 szt )",null,null,null,null,null,{"$f":"IF(V57=TRUE,'Załącznik16-F.O. dla Zadania 13'!D19,0)","v":0},null,null,null,null,null,null,null,null,null,null,false]
[null,6,"Płyn odkamieniający DELONGHI \"EcoDecalk\"","odkamieniacz do  ekspresu DELONGHI ","szt.   ",null,null,null,null,null,{"$f":"IF(V58=TRUE,'Załącznik17-F.O. dla Zadanie 14'!D19,0)","v":0},null,null,null,null,null,null,null,null,null,null,false]
[null,7,"Tabletki czyszczące KRUPS XS3000, 10 sztuk","Tabletki czyszczące przeznaczone do ekspresów ciśnieniowych i przelewowych Usuwają tłuszcz i pozostałości po kawie wewnątrz ekspresu. Regularne stosowanie gwarantuje utrzymanie wysokiej jakości kawy Jednostka sprzedaży: 1 opakowanie (10 sztuk)","op (10 szt)",null,null,null,null,null,{"$f":"IF(V59=TRUE,'Załącznik18-F.O. dla Zadania 15'!D19,0)","v":0},null,null,null,null,null,null,null,null,null,null,false]
[null,8,"Tabletki do zmywarek FINISH All-in-1, 50 tabletek","Jego unikalna formuła łączy w sobie działanie 10 funkcji Power Actions: usuwanie zaplamień, usuwanie tłuszczu, namaczanie, usuwanie zabrudzeń po herbacie, kryształowy połyski, lśniące sztućce, ochrona przed osadzaniem się kamienia w zmywarce, aktywna ochrona szkła, ochrona srebra, usuwanie opornych zabrudzeń, Dodatkowo spełnia funkcje soli i płynu nabłyszczającego, Składniki: 5 - 15 % związki wybielające na bazie tlenu, niejonowe środki powierzchniowo czynne, do 5 % polikarboksylany, fosfoniany. Enzymy (subtylizyna, amylaza), kompozycja zapachowa.","op (50 szt)"]
[null,9,"UNIWERSALNY zestaw do odkamieniania ekspresów","Uniwerslany zestaw do odkamieniania ekspresów Nespresso. Ilość sztuk w opakowaniu: 2 Jednostka sprzedaży: 1 opakowanie","op"]
[null,10,"Wkłady filtrujące BRITA Maxtra+ Pure Performance, 3 sztuki","Wybierając wkłady filtrujące Brita Maxtra+ Pure Performance, zapewniasz sobie czystą wodę o doskonałym smaku. Zastosowane perełki węgla aktywnego skutecznie zatrzymują chlor i redukują mogące występować w wodzie zanieczyszczenia, jak herbicydy, pestycydy czy pozostałości po farmaceutykach. Z kolei perełki wymiennika jonowego zmiękczają wodę i zmniejszają występowanie metali w rodzaju miedzi i ołowiu. Wkłady filtrując są rekomendowane do wody miękkiej i średnio twardej.","op (3 szt)"]
[null,11,"Worki papierowe do odkurzacza MERIDA Dex, 3 sztuki","Worki papierowe do odkurzacza MERIDA Dex, 3 sztuki","op (3 szt)"]
[null,12,"Wymienne wkłady do filtra wody AQUAPHOR MAXFOR","Największa na rynku wydajność - do 200 l, Zawiera innowacyjne włókno Aqualen, dzięki czemu skutecznie usuwa z wody chlor, metale ciężkie, fenol, pestycydy i inne zanieczyszczenia, Redukuje twardość wody i zapobiega pojawianiu się osadu i kamienia na urządzeniach AGD np. w czajnikach i ekspresach, Produkt wolny od bisfenolu A (BPA FREE), wykonany z ekologicznych materiałów","op (3 szt)"]
[null,13,"Zestaw do odkamieniania KRUPS F054, 2 saszetki po 40 g","Zestaw polecany do ekspresów KRUPS Informacje na temat sposobu użytkowania dostępne w instrukcji obsługi ekspresu W opakowaniu: 2 saszetki środka odkamieniającego Jednostka sprzedaży: 1 opakowanie (2 saszetki x 40 g)","op (2 saszetki)"]
[null,14,"Apteczka VERA TOP 15 PLUS, DIN 13157, w walizce z ABS","Apteczka w walizce z tworzywa ABS. Zawiera stelaż mocujący do ściany W skład wyposażenia wchodzą: kompres zimny – 1 szt., kompres na oko – 2 szt., kompres 10 x 10 cm - 3 opakowania (po 2 sztuki) opaska elastyczna 4 m x 6 cm – 2 szt., opaska elastyczna 4 m x 8 cm – 2 szt., zestaw plastrów 10 x 6 cm (8 szt.) – 1 komplet, zestaw plastrów (14 szt.) – 1 komplet, plaster 5 m x 2,5 cm – 1 szt., opatrunek indywidualny M sterylny – 3 szt. opatrunek indywidualny G sterylny – 1 szt., opatrunek indywidualny K sterylny – 1 szt., chusta opatrunkowa 60 x 80 cm – 1 szt. chusta trójkątna – 1 szt., chusta z flizeliny (5 szt.) – 1 komplet, koc ratunkowy 160 x 210 cm – 1 szt. nożyczki 19 cm – 1 szt., rękawice winylowe – 4 szt. chusteczka dezynfekująca – 6 sztuk, ustnik do sztucznego oddychania – 1 szt., instrukcja udzielania pierwszej pomocy Skład zgodny z normą DIN 13157. Rozmiar: 330 x 235 x 125 mm Jednostka sprzedaży: 1 sztuka","szt"]
[null,15,"Wyposażenie apteczki DIN 13157 PLUS","W skład wyposażenia wchodzą: kompres zimny – 1 szt., kompres na oko – 2 szt., kompres 10 x 10 cm - 3 opakowania (po 2 sztuki) opaska elastyczna 4 m x 6 cm – 2 szt., opaska elastyczna 4 m x 8 cm – 2 szt., zestaw plastrów 10 x 6 cm (8 szt.) – 1 komplet, zestaw plastrów (14 szt.) – 1 komplet, plaster 5 m x 2,5 cm – 1 szt., opatrunek indywidualny M sterylny – 3 szt. opatrunek indywidualny G sterylny – 1 szt., opatrunek indywidualny K sterylny – 1 szt., chusta opatrunkowa 60 x 80 cm – 1 szt. chusta trójkątna – 1 szt., chusta z flizeliny (5 szt.) – 1 komplet, koc ratunkowy 160 x 210 cm – 1 szt. nożyczki 19 cm – 1 szt., rękawice winylowe – 4 szt. chusteczka dezynfekująca – 6 sztuk, ustnik do sztucznego oddychania – 1 szt., instrukcja udzielania pierwszej pomocy Skład zgodny z normą DIN 13157. Rozmiar: 330 x 235 x 125 mm Jednostka sprzedaży: 1 sztuka","op"]
[null,16,"Chusteczki KATRIN Plus, 100 sztuk","Białe, dwuwarstwowe chusteczki higieniczne w praktycznym podajniku Testowane dermatologicznie Jednostka sprzedaży: 1 opakowanie (100 sztuk) ","op (100 szt)"]
[null,17,"Czajnik elektryczny TEFAL Express 1,5 l, biały","Filtr antywapienny i dwustronny wskaźnik poziomu wody, Możliwość zagotowania minimalnej ilości wody (250 ml), Pojemność: 1,5 l, Moc: 2400 W","szt"]
[null,18,"Czajnik elektryczny TEFAL Loft, 1,7 l, czarny","Zdejmowana pokrywa ułatwia napełnianie wodą, Czajnik posiada filtr antywapienny, który zapobiega przedostawaniu się kamienia do szklanki, Pojemność: 1,7 l, Moc: 2400 W","szt"]
[null,19,"Czyściwo włókninowe, wielozadaniowe do trudnych zabrudzeń TORK, 1 rolka","Jednowarstwowe, grube i mocne czyściwo wielozadaniowe non-woven (syntetyczno-celulozowe) Duża chłonność, także oleistych substancji Niskopylne i odporne na rozerwania Współpracuje z rozpuszczalnikami, ograniczając ich zużycie Polecane do stosowania w przemyśle maszynowym, poligraficznym, spożywczym  nawet do najcięższych zadań związanych z czyszczeniem Atest PZH i certyfikat ISEGA, zezwalający na stosowanie produktu w przemyśle spożywczym W wygodnym kartonie mogącym służyć jako dozownik Perforacja co 38 cm Materiał: włóknina jednowarstwowa Tłoczenie: nie Ilość listków: 280  szerokość listka: 320 mm Długość roli: 106,4 m  średnica r[...]","szt"]
[null,20,"Kij z mopem sznurkowym, 1 komplet","Kij z mopem sznurkowym, Waga: 345 g, Jednostka sprzedaży: 1 sztuka","szt"]
[null,21,"Nakładka CEG z mikrofibry na mop triple, długość 40 cm","Mop trójskładnikowy DUO (kieszeń + klips), Wykonany z bawełny, mikrowłókna i poliestru, Długość: 40 cm","szt"]
[null,22,"Ściereczki gąbczaste niebieskie, 3 sztuki","Bardzo trwałe i chłonne ścierki gąbczaste, wzmocnione wewnętrzną bawełnianą siatką, Najlepsze do wycierania wody, zmywania powierzchni i usuwania brudu","op. (3 szt)"]
[null,23,"Ścierka do podłogi, 50 x 60 cm, pomarańczowa","Ścierka do podłogi, 50 x 60 cm, pomarańczowaWymiary: 50 x 60 cm, Do czyszczenia dużych powierzchni","szt"]
[null,24,"Ścierka z mikrofibry KOLORADO, 35 x 35 cm","Ścierka z mikrofibry przeznaczona do czyszczenia powierzchni szklanych i stosowania w łazience, Skuteczna na sucho i mokro, Nie pozostawia smug, zacieków ani kłaczków, Skład: 80% poliester, 20% poliamid (nylon)","szt"]
[null,25,"Ścierki uniwersalne Practi Maxi 50sztuk","Ścierki uniwersalne Practi Maxi 50sztuk rozmiar 25 x 40","op (50 szt)"]
[null,26,"Ścierki uniwersalne, 5 sztuk","Ścierki wielokrotnego użytku Można je prać i sterylizować Wykonane z wiskozy, pachnące Miks kolorów Wymiary: 37 x 38 cm","op (5 szt)"]
[null,27,"Proszek do prania tkanin kolorowych DOSIA, 300 g","Proszek do prania tkanin kolorowych do wszystkich typów pralek i do prania ręcznego\nZawiera enzymy i aktywne składniki piorące\nNie zawiera chlorowych wybielaczy: jest delikatna dla kolorowych i ciemnych tkanin\nJednostka sprzedaży: 1 sztuka (300 g)","op (300g)"]
[null,28,"Proszek do prania tkanin PUROX, 5 kg","Do wszystkich typów pralek i do prania ręcznego, Jednostka sprzedaży: 1 opakowanie (5 kg), Składniki: do 5% anionowe i niejonowe środki powierzchniowo czynne, enzymy, kompozycja zapachowa, krzemiany, niejonowe środki powierzchniowo, czynne, regulatory piany, rozjaśniacze optyczne, związki wybielające na bazie tlenu","op (5 kg)"]
[null,29,"Chusteczki FELLOWES do czyszczenia ekranów, opakowanie 100szt","Chusteczki FELLOWES do czyszczenia ekranów, opakowanie 100szt","op (100 szt)"]
[null,30,"Płyn AJAX Floral Fiesta, 1 l","Doskonale usuwa kurz i brud, pozostawiając na długo świeży zapach Miks zapachów Pojemność: 1 l Jednostka sprzedaży 1 sztuka","op (1l)"]
[null,31,"Preparat do usuwania tłustego brudu VOIGT C457 Ultra Clean plus 1 l","Odtłuszczanie, gruntowne mycie bez fosforanów – Produkt do profesjonalnego zastosowania, Nie zawierający fosforanów, Usuwa zabrudzenia pochodzenia tłuszczowego i przemysłowego m.in. oleje, smary. Zalecany do: warsztatów, hal produkcyjnych, galerii handlowych, centrów logistycznych","op (1l)"]
[null,32,"Rozpuszczalnik do etykiet w sprayu, pojemność 200 ml","Produkt zapewnia w pełni bezpieczne usunięcie etykiet z dowolnej powierzchni, nie pozostawiając żadnych, śladów kleju. Pojemność 200 ml.","op (200 ml)"]
[null,33,"Gąbka do zmywania różowa, 5 sztuk","Gąbka do różnorodnych zastosowań, Kolor: różowy","op (5 szt)"]
[null,34,"Gąbki do zmywania standardowa, 5 sztuk","Do zmywania naczyń, szkła, ceramiki, powierzchni emaliowanych Wytrzymała Miks kolorów w opakowaniu Jednostka sprzedaży: 1 opakowanie (5 sztuk) ","op (5 szt)"]
[null,35,"Kuchenka mikrofalowa SEVERIN 7890/7862, biała","5 poziomów mocy, Rozmrażanie w oparciu o czas i wagę, 35-minutowy timer z sygnałem akustycznym, Pokrętło regulacyjne z chromowanymi elementami, Średnica wyjmowanego talerza ok. 25,4 cm, Wysokość komory ok. 16,5 cm, Obudowa i komora lakierowana powłoką odporną na wysokie temperatur, Wymiary: szer. 43,5, gł. 34,5, wys. 25,4 cm, Moc: 700 W","szt"]
[null,36,"Jednorazowa maska higieniczna 3-warstwowa, niebieska, 50 sztuk","Trójwarstwowa maska higieniczna. Wykonana z włókniny polipropylenowej (100%). ","op (50szt)"]
[null,37,"Półmaska FILTERSERVICE FS-623V NR D, FFP2, z zaworem, 10 sztuk","Czasza półmaski: - Igłowana włóknina poliestrowa,  - Włóknina polipropylenowa typu melt blown, - Włóknina osłonowa, - Zawór wydechowy, - Zapinki taśm nagłowia, - Taśma nagłowia","op (10szt)"]
[null,38,"Nawilżacz powietrza NU 5N","4 poziomy intensywności nawilżania, Automatyczna kontrola wilgotności, Demontowany zasobnik wody 5,2 l, Funkcja jonizacji","szt"]
[null,39,"Odświeżacz powietrza AMBI PUR, zapach kwiatowy, 300 ml","Wypełnia pomieszczenie zapachem najpiękniejszego wiosennego bukietu Pojemność: 300 ml Jednostka sprzedaży: 1 sztuka ","szt"]
[null,40,"Odświeżacz powietrza BRISE w sprayu","Odświeżając pomieszczenia pozostawia przyjemny zapach Pojemność: 300 ml Jednostka sprzedaży: 1 sztuka ","szt."]
[null,41,"Odświeżacz powietrza BRISE w żelu, miks zapachów","Masa netto: 150 g Miks zapachów Jednostka sprzedaży: 1 sztuka ","szt."]
[null,42,"Odświeżacz powietrza GREEN FRESH, 400 ml","Skutecznie neutralizuje i pochłania nieprzyjemne zapachy\nOdświeża i nawilża powietrze, pozostawiając w pomieszczeniu uczucie świeżości i czystości Pojemność: 400 ml Jednostka sprzedaży: 1 sztuka","op. (400 ml)"]
[null,43,"Patyczki zapachowe PACHNĄCA SZAFA, Słoneczne popołudnie, 50 ml","Patyczki zapachowe PACHNĄCA SZAFA nadają przyjemny i odświeżający zapach w każdym pomieszczeniu. Odświeżać ma bardzo ładną formę eleganckich patyczków w szklanym flakoniku.","op (50 ml)"]
[null,44,"Wkład do odświeżacza AMBI PUR, zapach ocean and wind","Wkład do elektrycznego odświeżacza powietrza AMBI PUR Wydajność wkładów: do 80 dni Jednostka sprzedaży: 1 sztuka ","szt"]
[null,45,"Papier toaletowy CLASSIC, biały, 8 rolek","Papier toaletowy CLASSIC, biały, 8 rolek Wymiary listka: szer. 100 x dł. 112 mm, Szerokość taśmy: 100 mm","op. (8 rolek)"]
[null,46,"Papier toaletowy ELLIS PROFESSIONAL JUMBO 130/2, 12 rolek","Papier do użytku profesjonalnego w pomieszczeniach o zwiększonym natężeniu użytkowania, Materiał: celuloza dwuwarstwowa, Gramatura: 2 x 16 g/m², Długość roli: 120 m; średnica roli: 19 cm; średnica gilzy: 6 cm","op (12 rolek)"]
[null,47,"Papier toaletowy KATRIN 11296 PLUS 160, biały, 8 rolek","Papier toaletowy KATRIN 11296 PLUS 160, biały, 8 rolek Gramatura: 2 x 16,5 g/m², Długość jednej rolki: 18,3 m","op. (8 rolek)"]
[null,48,"Supermocny Plaster do cięcia VISCOPLAST, 1 m x 8 cm","Opatrunek włókninowy o wysokiej chłonności, Plaster natychmiast przykleja się do skóry, nawet do wilgotnej, Ogranicza przywieranie opatrunku do rany","op (1m)"]
[null,49,"Uniwersalny zestaw plastrów 3M VISCOPLAST, 24 sztuki","Plastry z opatrunkiem do opatrywania drobnych ran i skaleczeń Hypoalergiczne i wodoodporne Przepuszczające powietrze W opakowaniu 24 plastry: plastry Minifol: 72 x 25 mm - 4 sztuki, 72 x 19 mm - 8 sztuk, 57 x 16 mm - 6 sztuk, 38x10 mm - 4 sztuki Plaster Prestopor 10 x 6 cm Plaster Prestovis Plus 10 x 6 cm Jednostka sprzedaży: 1 opakowanie","op. ( 24 szt)"]
[null,50,"Krem do rąk EVELINE ''Niewidzialne rękawiczki'', 100 ml","Odżywczo-ochronny krem do rąk z formułą witaminową Polecany do suchych i podrażnionych dłoni Pojemność: 100 ml Jednostka sprzedaży: 1 sztuka ","op do (100 ml)"]
[null,51,"Krem do rąk GARNIER do skóry bardzo suchej, 100 g","Regeneruje i odżywia zniszczoną skórę dłoni Zawiera alantoinę, glicerynę oraz czynnik filtrującyJednostka sprzedaży: 1 sztuka (100 g)","op. (100 g)"]
[null,52,"Ręcznik MALFINI, chabrowy, 70x140 cm","Tkana metka, która może również służyć jako wieszaczek, Ozdobiony wyszywaną bordiurą po obu brzegach, Sklad: 100% bawełna, frotte, Gramatura: 450g/m², Kolor: chabrowy, Rozmiar: 70x140 cm","szt"]
[null,53,"Ręcznik MALFINI, granatowy, 50x100 cm","Tkana metka, która może również służyć jako wieszaczek, Ozdobiony wyszywaną bordiurą po obu brzegach, Sklad: 100% bawełna, frotte, Gramatura: 450g/m², Kolor: granatowy","szt"]
[null,54,"Ręcznik MALFINI, szaro-czarny, 50x100 cm","Wykonane z wysokiej jakości frotte, odpowiednie pod haft, Miękkie, miłe w dotyku, dobrze absorbują wodę, Tkana metka, która może również służyć jako wieszaczek, Ozdobiony wyszywaną bordiurą po obu brzegach, Sklad: 100% bawełna, frotte, Gramatura: 450g/m² kolor szaroczany ","szt"]
[null,55,"Ręcznik MALFINI, szaro-czarny, 70x140 cm","Tkana metka, która może również służyć jako wieszaczek, Ozdobiony wyszywaną bordiurą po obu brzegach, Sklad: 100% bawełna, frotte, Gramatura: 450g/m², Kolor: szaroczarny Rozmiar: 70x140 cm","szt"]
[null,56,"Chusteczki higieniczne VELVET, 120 sztuk","Chusteczki higieniczne VELVET, 120 sztuk. W opakowaniu 120 sztuk, Produkt ma atest PZH, ","op (120 szt)"]
[null,57,"Ręcznik w roli ESTIMO 100/2, 500 listków","Wytrzymały, dwuwarstwowy ręcznik w 100% wykonany z celulozy o wysokich parametrach i pięknym designie Długość rolki: 100 m W rolce 500 odcinków o wymiarach: 20,3 x 20 cm Kolor biały Jednostka sprzedaży: 1 rolka ","op. (rolka 100 m)"]
[null,58,"Ręczniki papierowe białe, składka V, 20 x 200 listków","Gofrowane ręczniki w składce Kompatybilne ze standardowymi dozownikami do ręczników typu ZZ Materiał: makulatura jednowarstwowa Wymiary listka: 25 x 23 cm Gramatura: 1 x 30 g/m² Ilość bind w opakowaniu: 20 Ilość listków w bindzie: 200 Kolor: biały Jednostka sprzedaży: 1 karton (4000 listków)","op. (20 x 200 listków)"]
[null,59,"Ręczniki papierowe MERIDA składka V, 20 x 160 listków","Gofrowane ręczniki w składce wysokiej chłonności Kompatybilne ze standardowymi dozownikami do ręczników typu ZZ Materiał: makulatura dwuwarstwowa Wymiary listka: 25 x 23 cm Gramatura:2 x 19 g/m² Tłoczenie: nie Ilość bind w opakowaniu: 20 Ilość listków w bindzie: 160 Kolor: biały Jednostka sprzedaży: 1 karton (3200 listków)","op. (20 x 160 listków)"]
[null,60,"Ręczniki papierowe zielone, składka V, 20 x 200 listków","Gofrowane ręczniki w składce wysokiej chłonności Kompatybilne ze standardowymi dozownikami do ręczników typu ZZ Materiał: makulatura jednowarstwowa Wymiary listka: 25 x 23 cm Gramatura:2 x 19 g/m² Tłoczenie: nie Ilość bind w opakowaniu: 20 Ilość listków w bindzie: 160 Kolor: zielon. ","op. (20 x 200 listków)"]
[null,61,"Ręczniki w roli TORK UNIVERSAL Extra Długie do systemu TORK Matic H1, 6 rolek","Materiał: makulatura jednowarstwowa, Tłoczenie: nie, Ilość listków:1120, Długość roli: 280 m; wysokość roli: 21 cm; średnica roli: 19 cm; średnica gilzy: 3,8 cm","op. (6 rolek)"]
[null,62,"Rękawice antystatyczne ANSELL HyFlex® 11-800, rozmiar 9, para","Nylonowe rękawice z powłoką z pianki nitrylowej, wykonane w technologii KnitZonz™ Wszechstronne rozwiązanie do precyzyjnego montażu i prac ogólnych Zaawansowana technologia dziania zapewnia większą rozciągliwość i elastyczność w miejscach o zwiększonym nacisku Antystatyczne, zgodne z normą EN 1149 Norma EN 388 3131  Rozmiar: 9 Jednostka sprzedaży: 1 para ","op. (1 para)"]
[null,63,"Rękawice DELTAPLUS VV835 Chemsafe, rozmiar 11, para","Rękawica z podwójną powłoką nitrylową na wkładzie z poliamidu, Trzecia powłoka z szorstkiej pianki nitrylowej na stronie chwytnej i końcach palców, Długość: 35 cm, Grubość: 1,15 mm - 1,30 mm na stronie chwytnej","op, 1 (para)"]
[null,64,"Rękawice nitrylowe MEDASEPT PF, czarne, rozmiar S, 100 sztuk","Uniwersalne, rękawice pasujące na prawą i lewą dłoń, Nitrylowe, Tekstura na końcach palców, Rozmiar S","op. (100 szt)"]
[null,65,"Rękawice nitrylowe MEDASEPT PREMIER, niebieskie, rozmiar XL, 100 sztuk","Rękawice nitrylowe diagnostyczne i ochronne (kat. III), Bezpudrowe., Uniwersalny kształt pasuje na obie dłonie, Tekstura na końcach palców, Przeznaczone do kontaktu z żywnością.","op. (100 szt)"]
[null,66,"Rękawice nitrylowe MEDASEPT PRIME, niebieskie, rozmiar L, 100 sztuk","Rękawice nitrylowe diagnostyczne i ochronne, Bezpudrowe. Uniwersalny kształt pasuje na obie dłonie. ","op. (100 szt)"]
[null,67,"Rękawice nitrylowe MEDASEPT PRIME, niebieskie, rozmiar M, 100 sztuk","Rękawice nitrylowe diagnostyczne i ochronne","op. (100 szt)"]
[null,68,"Ręcznik kuchenny VELVET Jumbo, 1 rolka","Dwuwarstwowy ręcznik papierowy, który świetnie nadaje się do generalnych porządków, prac w garażu, ogrodzie oraz w kuchni Giga rola = 13 standardowych rolek Nie tylko chłonny i wytrzymały, ale także wyjątkowo wydajny Jedna rolka zawiera aż 520 listków Wysokość rolki: 22 cm Kolor biały Jednostka sprzedaży: 1 rolka ","szt ( 1 rolka)"]
[null,69,"Ręcznik papierowy BRATEK biały, 2 rolki","Ręczniki kuchenne, dwuwarstwowe, celulozowe Szerokość rolki: 22 cm Długość rolki: 11 m Jednostka sprzedaży: 1 opakowanie (2 sztuki)","op (2 rolki)"]
[null,70,"Ręczniki kuchenne AHA, 2 rolki","Dwuwarstwowy ręcznik wykonany z czystej celulozy W rolce 50 odcinków o wymiarach: 23 x 20 cm W opakowaniu: 2 rolki Kolor biały Jednostka sprzedaży: 1 opakowanie ","op (2 rolki)"]
[null,71,"Ręczniki kuchenne VELVET, 2 rolki","Produkt wolny od bisfenolu A (BPA FREE), posiada atest NIZP-PZH","op. (2 rolki)"]
[null,72,"Łyżeczki do herbaty AMEFA Bologna, 12 sztuk","subtelne i eleganckie łyżeczki do herbaty, Sztućce polerowane, stal 18/0","op (12 szt)"]
[null,73,"Łyżeczki do kawy AMEFA Bologna, 12 sztuk","Klasyczne, proste w formie, subtelne i eleganckie łyżeczki do kawy Dobra jakość w atrakcyjnej cenie powodują, iż linia od lat cieszy się wyjątkową popularnością  Sztućce polerowane, stal 18/0","op (12 szt)"]
[null,74,"Łyżki AMEFA Bologna, 12 sztuk","Sztućce polerowane, stal 18/0","op (12 szt)"]
[null,75,"Widelce AMEFA Bologna, 12 sztuk","\nSztućce polerowane, stal 18/0, ","op (12 szt)"]
[null,76,"Ściereczki mokre do mebli drewnianych PRESTO, opakowanie 72 sztuki","Ściereczki nawilżane do czyszczenia różnych powierzchni, Usuwają kurz i zapobiegają jego osadzaniu, Nadają połysk czyszczonym powierzchniom","op. (72 szt)"]
[null,77,"Kulki do toalet BREF Power Activ, 50 g, zapach cytrynowy","Nowoczesne rozwiązanie w postaci czterech kulek na wygodnej zawieszce Czyszczą, pozostawiają przyjemny zapach i chronią przed osadzaniem się kamienia Masa netto: 50 g Jednostka sprzedaży: 1 sztuka ","op. (50 g)"]
[null,78,"Kulki do toalet BREF Power Activ, 50 g, zapach morski","Nowoczesne rozwiązanie w postaci czterech kulek na wygodnej zawieszce Czyszczą, pozostawiają przyjemny zapach i chronią przed osadzaniem się kamienia Masa netto: 50 g Jednostka sprzedaży: 1 sztuka ","op. (50 g)"]
[null,79,"Płyn CILIT Bang Kamień i brud, 750 ml","Żel CILIT kamień i brud z Turbo Power. Do czyszczenia wanien, kabin prysznicowych, płytek, toalet, armatury kuchennej i łazienkowej Usuwa kamień, rdzawe zacieki z twardej wody, osad z mydła i inne zabrudzenia Pojemność: 750 ml Jednostka sprzedaży: 1 sztuka","op. (750 ml)"]
[null,80,"Płyn do toalet DOMESTOS Toilet Limescale Remover, 750 ml","Gęsty płyn do czyszczenia muszli klozetowych Formuła ściśle przylegająca do czyszczonych powierzchni, rozpuszcza kamień wapienny Przeznaczony do powierzchni porcelanowych i szkliwionych Butelka z wygodnym dozownikiem Pojemność: 750 ml Jednostka sprzedaży: 1 sztuka","op. (750 ml)"]
[null,81,"Płyn do WC DOMESTOS 24H, 1,25 l, cytrynowy","Produkt czyszcząco-dezynfekująco-wybielający Możliwość stosowania do: muszli klozetowych, umywalek, zlewów itp. Produkt nadaje się także do wybielania tkanin Jednostka sprzedaży: 1 sztuka Pojemność: 1,25 l ","op. (1,25 l)"]
[null,82,"Płyn do WC DOMESTOS 24H, 1,25 l, leśny","Produkt czyszcząco-dezynfekująco-wybielający Możliwość stosowania do: muszli klozetowych, umywalek, zlewów itp. Produkt nadaje się także do wybielania tkanin Pojemność: 1,25 l Jednostka sprzedaży: 1 sztuka ","op. (1,25 l)"]
[null,83,"Wkład zapachowy do pisuarów MERIDA, czerwony","Winylowy, elastyczny wkład zapachowy do pisuarów, Zapach utrzymuje się przez około 30 dni, Dodatkowo wkład zabezpiecza pisuar przed zapchaniem","szt."]
[null,84,"Zawieszka do WC DOMESTOS, zapach leśny","Zawieszki czyszczące do toalet Chronią przed osadzaniem się kamienia i pozostawiają świeży zapach Jednostka sprzedaży 1 sztuka ","szt"]
[null,85,"Żel BREF do WC Fresh Mist, 700 ml","Usuwa kamień, brud i osad, Gęsta formuła żelu sprawia, że działa on również pod powierzchnią wody.","op. (700 ml)"]
[null,86,"Żel CLINEX Drill do udrażniania odpływów, 1 l","Szybko rozpuszcza wszelkie stałe i organiczne zanieczyszczenia takie jak: tłuszcz, papier, wata, odpadki kuchenne, Forma żelowa pozwala na osadzanie się preparatu na ściankach rur, przedłużając proces działania, Likwiduje nieprzyjemne zapachy, Nadaje się do udrażniania rur zarówno w kuchni, jak i w łazience","op. (1 l)"]
[null,87,"Biobójczy płyn do dezynfekcji rąk HISKIN, 1 l","Produkt przeznaczony do codziennego stosowania przez użytkownika powszechnego. Wykazuje działanie bakteriobójcze, grzybobójcze i wirusobójcze","op. (1 l)"]
[null,88,"Dozownik do mydła w płynie MERIDA TOP, biały","Mocny i trwały dozownik do mydła w płynie wykonany z tworzywa ABS Okienko umożliwiające kontrolę zużycia mydła Pojemność: 0,8 l Zestaw do montażu w komplecie Wymiary: dł. 11,5 x szer.11,5 x wys. 25 cm Kolor: biały Jednostka sprzedaży: 1 sztuka","szt."]
[null,89,"Mydło toaletowe NIVEA, 100 g","Kremowe mydło z odżywczym olejkiem migdałowym Miks zapachów Jednostka sprzedaży: 1 sztuka ","szt. (100 g)"]
[null,90,"Mydło w płynie MERIDA Silva, 5 l","Mydło w płynie typu „dwa w jednym”, Zawiera m.in. glukopony mające doskonałe właściwości pielęgnacyjne skóry, jak również gluadyny – roślinne proteiny, szczególnie cenne składniki pielęgnacyjne chroniące skórę i włosy","op. (5l)"]
[null,91,"Mydło w płynie PALMOLIVE, migdałowe, 300 ml","Dzięki naturalnemu pH nie podrażnia nawet wrażliwej skóry Zawiera kombinację substancji czyszczących i odżywczych Opakowanie z dozownikiem Pojemność 300 ml Jednostka sprzedaży: 1 sztuka Opakowanie zbiorcze: 12 sztuk","op. (300 ml)"]
[null,92,"Pasta BHP do rąk, ścierna, 500 g","Usuwa silne zabrudzenia smarami, tłuszczami, sadzami","op. (500g)"]
[null,93,"Pasta do rąk MERIDA PA12, 500 ml","Usuwa wszelkie zabrudzenia nawet powstałe od smarów i olejów, Oszczędna w użyciu, Jest niealkaliczna i nie zawiera mineralnych środków ściernych","op. (500 ml)"]
[null,94,"Kapsułki do zmywarek FAIRY Jar All in 1, 115 kapsułek","Wydajne kapsułki do maszynowego mycia naczyń Jednostka sprzedaży: 1 opakowanie (115 kapsułek) ","op. ( 115 szt)"]
[null,95,"Płyn do czyszczenia zmywarek FINISH, 250 ml","Płyn do czyszczenia zmywarek o zapachu cytrynowym Pojemność: 250 ml Jednostka sprzedaży 1 opakowanie","op (250 ml)"]
[null,96,"Płyn do mycia naczyń LUDWIK 1150 g","Posiada bardzo dobre właściwości myjące oraz wysoką zdolność do emulgowania tłuszczów zarówno w ciepłej, jak i zimnej wodzie. Nie pozostawia zacieków na umytych powierzchniach, nadaje im połysk bez konieczności wycierania do sucha. Nowa receptura została również wzbogacona kompleksem witamin A,E,F,H, mającym działanie ochronne i odżywcze dla skóry rąk, Polecany również do mycia mebli, lodówek, wykładzin, podłóg, glazury, dywanów i tworzyw sztucznych","op. (1150 g)"]
[null,97,"Płyn do mycia naczyń LUDWIK cytrynowy, 5 kg","Posiada bardzo dobre właściwości myjące oraz wysoką zdolność do emulgowania tłuszczów zarówno w ciepłej, jak i zimnej wodzie. Nie pozostawia zacieków na umytych powierzchniach, nadaje im połysk bez konieczności wycierania do sucha. Nowa receptura została również wzbogacona kompleksem witamin A,E,F,H, mającym działanie ochronne i odżywcze dla skóry rąk, Polecany również do mycia mebli, lodówek, wykładzin, podłóg, glazury, dywanów i tworzyw sztucznych","5 kg"]
[null,98,"Płyn do mycia naczyń LUDWIK Miętowy 1 l.","Posiada bardzo dobre właściwości myjące oraz wysoką zdolność do emulgowania tłuszczów zarówno w ciepłej, jak i zimnej wodzie. Nie pozostawia zacieków na umytych powierzchniach, nadaje im połysk bez konieczności wycierania do sucha. Nowa receptura została również wzbogacona kompleksem witamin A,E,F,H, mającym działanie ochronne i odżywcze dla skóry rąk, Polecany również do mycia mebli, lodówek, wykładzin, podłóg, glazury, dywanów i tworzyw sztucznych","op. (1 l)"]
[null,99,"Płyn do mycia naczyń LUDWIK, cytrynowy, 450 g","Posiada bardzo dobre właściwości myjące oraz wysoką zdolność do emulgowania tłuszczów zarówno w ciepłej, jak i zimnej wodzie. Nie pozostawia zacieków na umytych powierzchniach, nadaje im połysk bez konieczności wycierania do sucha. Nowa receptura została również wzbogacona kompleksem witamin A,E,F,H, mającym działanie ochronne i odżywcze dla skóry rąk, Polecany również do mycia mebli, lodówek, wykładzin, podłóg, glazury, dywanów i tworzyw sztucznych","op. (450g)"]
[null,100,"Płyn do naczyń LUDWIK, 450 g, miętowy"," Nie pozostawia zacieków na umytych powierzchniach, nadaje im połysk bez konieczności wycierania do sucha. Polecany również do mycia mebli, lodówek, wykładzin, podłóg, glazury, dywanów i tworzyw sztucznych.","op.(450g)"]
[null,101,"Płyn nabłyszczający do zmywarek LUDWIK, 750 ml","Przeznaczony do płukania i nabłyszczania naczyń zmywanych w zmywarce Dzięki właściwie dobranym składnikom i zawartości kwasku cytrynowego płyn sprawia, że myte naczynia wysychają bez plam i zacieków Jednostka sprzedaży: 1 opakowanie (750 ml)","op. (750 ml)"]
[null,102,"Płyn nabłyszczający FINISH, 400 ml","Usuwa ślady po kroplach wody i osad z kamienia, pozostawiając Diamentowy Połysk Jednostka sprzedaży: 1 opakowanie (400 ml)","op. (400 ml)"]
[null,103,"Sól ochronna do zmywarki LUDWIK, 1,5 kg","Preparat chroniący zmywarkę przed osadzaniem się kamienia w jej wnętrzu i na mytych naczyniach Skutecznie zmiękcza wodę dzięki zastosowanej formule, preparat zawiera całkowicie rozpuszczalną szlachetną sól z granulkami o odpowiedniej wielkości Regularne stosowanie soli ochronnej Ludwik zapewnia prawidłowe funkcjonowanie zmywarki i długotrwałą ochronę jej mechanizmów Jednostka sprzedaży: 1 opakowanie (1,5 kg)","op. (1 l)"]
[null,104,"Sól SOMAT do zmywarek, 1,5 kg","Zabezpiecza zmywarkę oraz naczynia przed osadzaniem się kamienia Wygodna w użyciu sól ma postać granulek Opakowanie: 1,5 kg Jednostka sprzedaży: 1 sztuka ","op. (5 kg)"]
[null,105,"Tabletki do zmywarek LUDWIK, 30 sztuk","Wielofunkcyjne tabletki czyszczą, nabłyszczają, chronią szkło i stal nierdzewną przed matowieniem oraz zabezpieczają zmywarkę przed osadzaniem się kamienia Funkcja zmiękczania wody pozwala na jeszcze bardziej efektywne wykorzystanie składników myjących Enzymy są aktywne już w 30°C Cytrusowy aromat tabletek nadaje długotrwały zapach świeżości w kuchni Zapewniają oszczędność wody i energii Jednostka sprzedaży: 1 opakowanie ( 30 tabletek)","op. (30 szt)"]
[null,106,"Płyn do mycia szyb i glazury LUDWIK grapefruit z octem, 750 ml","Nie pozostawia smug, zacieków i szybko odparowuje., Skład: do 5% anionowe środki powierzchniowo czynne, konserwant (2-bromo-2-nitropropane-1,3-diol, methylchloroisothiazolinone, methylisothiazolinone), kompozycja zapachowa (limonene, linalool).","op. (750ml)"]
[null,107,"Płyn do mycia szyb KUBUŚ z atomizerem, 1 l","Przeznaczony do mycia szyb okiennych, luster oraz innych powierzchni szklanych, Doskonale usuwa brud, nie pozostawia smug","op. (1 l)"]
[null,108,"Płyn do szyb i luster BUZIL G522 Profiglass, 600 ml","Gotowy do użycia środek do mycia szyb i luster Skutecznie usuwa zabrudzenia, również te tłuste\nButelka posiada specjalnie przyciętą końcówkę rozpryskującą, która ułatwia nanoszenie środka czyszczącego Wygodna butelka 600 ml ze spryskiwaczem","op (600 ml)"]
[null,109,"Mleczko do czyszczenia CIF Regular Cream, 650 ml/780 g","Uniwersalne mleczko CIF z mikrokryształkami, które pomaga utrzymać powierzchnie w czystości, jest delikatne i nie rysuje powierzchni. Usuwa najbardziej oporny brud taki jak: przypieczony tłuszcz, przypalone jedzenie, plamy z kamienia w łazience. Składniki: do 5% anionowe środki powierzchniowo, czynne niejonowe środki powierzchniowo czynne, mydło, kompozycja zapachowa Limonene, Benzisothiazolinone, Linalool, Butylphenyl Methylpropional, Hexyl Cinnamal. Sposób użycia: nanieść na wilgotną ściereczkę lub bezpośrednio na czyszczoną powierzchnię. Po wyczyszczeniu dokładnie spłukać. Nie połykać. Mleczko do czyszczenia powierzchni twardych.","op (650 ml)"]
[null,110,"Czajnik elektryczny TEFAL Express 1,5 l, biały","Czajnik z ukrytym elementem grzejnym i obrotową podstawą, Filtr antywapienny i dwustronny wskaźnik poziomu wody, Możliwość zagotowania minimalnej ilości wody (250 ml), Pojemność: 1,5 l","szt."]
[null,111,"Dzbanek filtrujący wodę AQUAPHOR Onyx 4,2 l + 3 wkłady filtrujące, biały","Klasyczny i elegancki kształt pasuje do biur i sal konferencyjnych, Produkt wolny od bisfenolu A (BPA FREE), posiada atest NIZP-PZH, W zestawie 3 wkłady Maxfor MG wzbogacające wodę w magnez","op. (1 szt dzbanek + 3 szt. filtrów)"]
[null,112,"Filtr wody KRUPS F08801 do ekspresu ciśnieniowego, 1 sztuka","Zapobiega nadmiernemu osadzaniu się kamienia Dostosowany do ekspresów Krups Artese oraz Krups Orchestro Jednostka sprzedaży: 1 sztuka","szt"]
[null,113,"Termos TEFAL Campo, 1 l, czarny","Termos TEFAL Campo, 1 l, czarnyObudowa ze stali nierdzewnej z kolorową powłoką z wkładką szklaną, Kolor: czarny","szt"]
[null,114,"Reklamówki foliowe 9 micronów 210 + 2 x 60 x 435 mm (+/-12), 150 sztuk","Reklamówki o wymiarach 210 + 2 x 60 x 435 mm (+/-12) Nawój: 150 sztuk\nFolia HDPE / grubość 9 mikronówJednostka sprzedaży: 1 rolka (150sztuk)\n","op. (150 szt.)"]
[null,115,"Worki do segregacji 60 l, niebieskie na papier, 60 x 72 cm","Wytrzymałe worki ułatwiające segregację śmieci dzięki kodowi kolorystycznemu, Mają nadruk informujący, jakie typy odpadów należy do nich wrzucać, a jakich nie należy, Wymiary: 60 x 72 cm","op. (10 worków)"]
[null,116,"Worki do segregacji 60 l, zielone na szkło, 60 x 72 cm","Wytrzymałe worki ułatwiające segregację śmieci dzięki kodowi kolorystycznemu, Mają nadruk informujący, jakie typy odpadów należy do nich wrzucać, a jakich nie należy, Wymiary: 60 x 72 cm","op. (10 worków)"]
[null,117,"Worki do segregacji 60 l, zółte na plastik, 60 x 72 cm","Wytrzymałe worki ułatwiające segregację śmieci dzięki kodowi kolorystycznemu, Mają nadruk informujący, jakie typy odpadów należy do nich wrzucać, a jakich nie należy, Wymiary: 60 x 72 cm","op. (10 worków)"]
[null,118,"Worki na śmieci LDPE sanitarne 120 l, niebieskie, 10 sztuk","Wymiary: 110 x 70 cm, Grubość: folii: 0,03 mm","op (10 szt)"]
[null,119,"Worki na śmieci LDPE sanitarne 160 l, czarne, 20 sztuk","Worki na śmieci LDPE sanitarne 160 l, czarne, 20 sztuk Pojemność: 160 l Wymiary: 150 x 90 cm Grubość: folii: 0,027 mm Kolor folii: czarny Jednostka sprzedaży: 1 opakowanie (20 sztuk)","op. (20 sztuk)"]
[null,120,"Worki na śmieci LDPE z taśmą ściągającą 60 l, czarne, 10 sztuk","Posiadają taśmę ściągającą Pojemność: 60 l Wymiary: 72 x 60 cm Grubość: folii: 0,02 mm Kolor folii: czarny Jednostka sprzedaży: 1 opakowanie (10 sztuk)","op. (10 sztuk)"]
[null,121,"Worki na śmieci łazienkowe, 20 l, białe, 40 sztuk","Idealne worki na odpady łazienkowe, Pojemność: 20 l, Kolor: biały, Rozmiar: 40 x 50 cm","op: (40 sztuk)"]
[null,122,"Worki na śmieci MDPE 35 l, niebieskie 20 sztuk","Pojemność: 35 l Wymiary: 58 x 49 cm Grubość: folii: 0,011 mm Kolor folii: niebieski Jednostka sprzedaży: 1 opakowanie (20 sztuk)","op. (20 sztuk)"]
[]
[]
[]
[null,"miejscowość i data",null,"Pieczęć imienna i podpis przedstawiciela(i) Wykonawcy"]

{"sheet":"zadanie 11-12","index":1,"n_rows":122,"n_cols":4,"rows_kept":122,"cut":false,"hidden":true,"merged":[]}
[1,"Filtr do expresu DELONGHI 45.76X","Filtr do expresu DELONGHI 45.76X","szt"]
[2,"ODKAMIENIACZ DO EKSPRESU MELITTA 250ML","odkamieniacz do  ekspresu MELITA poj. 250 ml.","szt. (250 ml)"]
[3,"Odkamieniacz KAMIX, w proszku, 150 g","Środek do usuwania osadów z kamienia Pojemność: 150 g Jednostka sprzedaży: 1 opakowanie ","op. ( 150 g)"]
[4,"Odkamieniacz uniwersalny KAMIX, w płynie, 500 ml","Środek w płynie do usuwania osadów kamienia Pojemność: 500 ml Jednostka sprzedaży: 1 opakowanie ","op. (500 ml)"]
[5,"płyn do czyszczenia sekcji mlecznej ekspresu","Tabletki do codziennego czyszczenia sekcji mlecznej zapewniają dokładne i higieniczne użytkowanie sekcji mlecznej Jednostka sprzedaży: 1 opakowanie","op."]
[6,"Płyn odkamieniający DELONGHI \"EcoDecalk\"","odkamieniacz do  ekspresu DELONGHI ","szt.   "]
[7,"Tabletki czyszczące KRUPS XS3000, 10 sztuk","Tabletki czyszczące przeznaczone do ekspresów ciśnieniowych i przelewowych Usuwają tłuszcz i pozostałości po kawie wewnątrz ekspresu. Regularne stosowanie gwarantuje utrzymanie wysokiej jakości kawy Jednostka sprzedaży: 1 opakowanie (10 sztuk)","op (10 szt)"]
[8,"Tabletki do zmywarek FINISH All-in-1, 50 tabletek","Jego unikalna formuła łączy w sobie działanie 10 funkcji Power Actions: usuwanie zaplamień, usuwanie tłuszczu, namaczanie, usuwanie zabrudzeń po herbacie, kryształowy połyski, lśniące sztućce, ochrona przed osadzaniem się kamienia w zmywarce, aktywna ochrona szkła, ochrona srebra, usuwanie opornych zabrudzeń, Dodatkowo spełnia funkcje soli i płynu nabłyszczającego, Składniki: 5 - 15 % związki wybielające na bazie tlenu, niejonowe środki powierzchniowo czynne, do 5 % polikarboksylany, fosfoniany. Enzymy (subtylizyna, amylaza), kompozycja zapachowa.","op (50 szt)"]
[9,"UNIWERSALNY zestaw do odkamieniania ekspresów","Uniwerslany zestaw do odkamieniania ekspresów Nespresso. Ilość sztuk w opakowaniu: 2 Jednostka sprzedaży: 1 opakowanie","op"]
[10,"Wkłady filtrujące BRITA Maxtra+ Pure Performance, 3 sztuki","Wybierając wkłady filtrujące Brita Maxtra+ Pure Performance, zapewniasz sobie czystą wodę o doskonałym smaku. Zastosowane perełki węgla aktywnego skutecznie zatrzymują chlor i redukują mogące występować w wodzie zanieczyszczenia, jak herbicydy, pestycydy czy pozostałości po farmaceutykach. Z kolei perełki wymiennika jonowego zmiękczają wodę i zmniejszają występowanie metali w rodzaju miedzi i ołowiu. Wkłady filtrując są rekomendowane do wody miękkiej i średnio twardej.","op (3 szt)"]
[11,"Worki papierowe do odkurzacza MERIDA Dex, 3 sztuki","Worki papierowe do odkurzacza MERIDA Dex, 3 sztuki","op (3 szt)"]
[12,"Wymienne wkłady do filtra wody AQUAPHOR MAXFOR","Największa na rynku wydajność - do 200 l, Zawiera innowacyjne włókno Aqualen, dzięki czemu skutecznie usuwa z wody chlor, metale ciężkie, fenol, pestycydy i inne zanieczyszczenia, Redukuje twardość wody i zapobiega pojawianiu się osadu i kamienia na urządzeniach AGD np. w czajnikach i ekspresach, Produkt wolny od bisfenolu A (BPA FREE), wykonany z ekologicznych materiałów","op"]
[13,"Zestaw do odkamieniania KRUPS F054, 2 saszetki po 40 g","Zestaw polecany do ekspresów KRUPS Informacje na temat sposobu użytkowania dostępne w instrukcji obsługi ekspresu W opakowaniu: 2 saszetki środka odkamieniającego Jednostka sprzedaży: 1 opakowanie (2 saszetki x 40 g)","op (2 saszetki)"]
[14,"Apteczka VERA TOP 15 PLUS, DIN 13157, w walizce z ABS","Apteczka w walizce z tworzywa ABS. Zawiera stelaż mocujący do ściany W skład wyposażenia wchodzą: kompres zimny – 1 szt., kompres na oko – 2 szt., kompres 10 x 10 cm - 3 opakowania (po 2 sztuki) opaska elastyczna 4 m x 6 cm – 2 szt., opaska elastyczna 4 m x 8 cm – 2 szt., zestaw plastrów 10 x 6 cm (8 szt.) – 1 komplet, zestaw plastrów (14 szt.) – 1 komplet, plaster 5 m x 2,5 cm – 1 szt., opatrunek indywidualny M sterylny – 3 szt. opatrunek indywidualny G sterylny – 1 szt., opatrunek indywidualny K sterylny – 1 szt., chusta opatrunkowa 60 x 80 cm – 1 szt. chusta trójkątna – 1 szt., chusta z flizeliny (5 szt.) – 1 komplet, koc ratunkowy 160 x 210 cm – 1 szt. nożyczki 19 cm – 1 szt., rękawice winylowe – 4 szt. chusteczka dezynfekująca – 6 sztuk, ustnik do sztucznego oddychania – 1 szt., instrukcja udzielania pierwszej pomocy Skład zgodny z normą DIN 13157. Rozmiar: 330 x 235 x 125 mm Jednostka sprzedaży: 1 sztuka","szt"]
[15,"Wyposażenie apteczki DIN 13157 PLUS","Czajnik posiada filtr antywapienny, który zapobiega przedostawaniu się kamienia do szklanki, Pojemność: 1,7 l Moc: 2400 W","op"]
[16,"Chusteczki KATRIN Plus, 100 sztuk","Białe, dwuwarstwowe chusteczki higieniczne w praktycznym podajniku Testowane dermatologicznie Jednostka sprzedaży: 1 opakowanie (100 sztuk) ","op (100 szt)"]
[17,"Czajnik elektryczny TEFAL Express 1,5 l, biały","Filtr antywapienny i dwustronny wskaźnik poziomu wody, Możliwość zagotowania minimalnej ilości wody (250 ml), Pojemność: 1,5 l, Moc: 2400 W","szt"]
[18,"Czajnik elektryczny TEFAL Loft, 1,7 l, czarny","Zdejmowana pokrywa ułatwia napełnianie wodą, Czajnik posiada filtr antywapienny, który zapobiega przedostawaniu się kamienia do szklanki, Pojemność: 1,7 l, Moc: 2400 W","szt"]
[19,"Czyściwo włókninowe, wielozadaniowe do trudnych zabrudzeń TORK, 1 rolka","Jednowarstwowe, grube i mocne czyściwo wielozadaniowe non-woven (syntetyczno-celulozowe) Duża chłonność, także oleistych substancji Niskopylne i odporne na rozerwania Współpracuje z rozpuszczalnikami, ograniczając ich zużycie Polecane do stosowania w przemyśle maszynowym, poligraficznym, spożywczym  nawet do najcięższych zadań związanych z czyszczeniem Atest PZH i certyfikat ISEGA, zezwalający na stosowanie produktu w przemyśle spożywczym W wygodnym kartonie mogącym służyć jako dozownik Perforacja co 38 cm Materiał: włóknina jednowarstwowa Tłoczenie: nie Ilość listków: 280  szerokość listka: 320 mm Długość roli: 106,4 m  średnica r[...]","szt"]
[20,"Kij z mopem sznurkowym, 1 komplet","Kij z mopem sznurkowym, Waga: 345 g, Jednostka sprzedaży: 1 sztuka","szt"]
[21,"Nakładka CEG z mikrofibry na mop triple, długość 40 cm","Mop trójskładnikowy DUO (kieszeń + klips), Wykonany z bawełny, mikrowłókna i poliestru, Długość: 40 cm","szt"]
[22,"Ściereczki gąbczaste niebieskie, 3 sztuki","Bardzo trwałe i chłonne ścierki gąbczaste, wzmocnione wewnętrzną bawełnianą siatką, Najlepsze do wycierania wody, zmywania powierzchni i usuwania brudu","op. (3 szt)"]
[23,"Ścierka do podłogi, 50 x 60 cm, pomarańczowa","Ścierka do podłogi, 50 x 60 cm, pomarańczowaWymiary: 50 x 60 cm, Do czyszczenia dużych powierzchni","szt"]
[24,"Ścierka z mikrofibry KOLORADO, 35 x 35 cm","Ścierka z mikrofibry przeznaczona do czyszczenia powierzchni szklanych i stosowania w łazience, Skuteczna na sucho i mokro, Nie pozostawia smug, zacieków ani kłaczków, Skład: 80% poliester, 20% poliamid (nylon)","szt"]
[25,"Ścierki uniwersalne Practi Maxi 50sztuk","Ścierki uniwersalne Practi Maxi 50sztuk rozmiar 25 x 40","op (50 szt)"]
[26,"Ścierki uniwersalne, 5 sztuk","Ścierki wielokrotnego użytku Można je prać i sterylizować Wykonane z wiskozy, pachnące Miks kolorów Wymiary: 37 x 38 cm","op (5 szt)"]
[27,"Proszek do prania tkanin kolorowych DOSIA, 300 g","Proszek do prania tkanin kolorowych do wszystkich typów pralek i do prania ręcznego\nZawiera enzymy i aktywne składniki piorące\nNie zawiera chlorowych wybielaczy: jest delikatna dla kolorowych i ciemnych tkanin\nJednostka sprzedaży: 1 sztuka (300 g)","op (300g)"]
[28,"Proszek do prania tkanin PUROX, 5 kg","Do wszystkich typów pralek i do prania ręcznego, Jednostka sprzedaży: 1 opakowanie (5 kg), Składniki: do 5% anionowe i niejonowe środki powierzchniowo czynne, enzymy, kompozycja zapachowa, krzemiany, niejonowe środki powierzchniowo, czynne, regulatory piany, rozjaśniacze optyczne, związki wybielające na bazie tlenu","op (5 kg)"]
[29,"Chusteczki FELLOWES do czyszczenia ekranów, opakowanie 100szt","Chusteczki FELLOWES do czyszczenia ekranów, opakowanie 100szt","op (100 szt)"]
[30,"Płyn AJAX Floral Fiesta, 1 l","Doskonale usuwa kurz i brud, pozostawiając na długo świeży zapach Miks zapachów Pojemność: 1 l Jednostka sprzedaży 1 sztuka","op (1l)"]
[31,"Preparat do usuwania tłustego brudu VOIGT C457 Ultra Clean plus 1 l","Odtłuszczanie, gruntowne mycie bez fosforanów – Produkt do profesjonalnego zastosowania, Nie zawierający fosforanów, Usuwa zabrudzenia pochodzenia tłuszczowego i przemysłowego m.in. oleje, smary. Zalecany do: warsztatów, hal produkcyjnych, galerii handlowych, centrów logistycznych","op (1l)"]
[32,"Rozpuszczalnik do etykiet w sprayu, pojemność 200 ml","Produkt zapewnia w pełni bezpieczne usunięcie etykiet z dowolnej powierzchni, nie pozostawiając żadnych, śladów kleju. Pojemność 200 ml.","op (200 ml)"]
[33,"Gąbka do zmywania różowa, 5 sztuk","Gąbka do różnorodnych zastosowań, Kolor: różowy","op (5 szt)"]
[34,"Gąbki do zmywania standardowa, 5 sztuk","Do zmywania naczyń, szkła, ceramiki, powierzchni emaliowanych Wytrzymała Miks kolorów w opakowaniu Jednostka sprzedaży: 1 opakowanie (5 sztuk) Opakowanie zbiorcze: 18 opakowań","op (5 szt)"]
[35,"Kuchenka mikrofalowa SEVERIN 7890/7862, biała","5 poziomów mocy, Rozmrażanie w oparciu o czas i wagę, 35-minutowy timer z sygnałem akustycznym, Pokrętło regulacyjne z chromowanymi elementami, Średnica wyjmowanego talerza ok. 25,4 cm, Wysokość komory ok. 16,5 cm, Obudowa i komora lakierowana powłoką odporną na wysokie temperatur, Wymiary: szer. 43,5, gł. 34,5, wys. 25,4 cm, Moc: 700 W","szt"]
[36,"Jednorazowa maska higieniczna 3-warstwowa, niebieska, 50 sztuk","Trójwarstwowa maska higieniczna. Wykonana z włókniny polipropylenowej (100%). Materiał: Texfil 25 (Spunbond) + Texfil 25 (Spunbond) + Texfil 25 (Spunbond). Gramatura: 25 gsm + 25 gsm + 25 gsm= 75 gsm. Gumki – długość 16cm - 18cm (± 1cm).","op (50szt)"]
[37,"Półmaska FILTERSERVICE FS-623V NR D, FFP2, z zaworem, 10 sztuk","Czasza półmaski: - Igłowana włóknina poliestrowa,  - Włóknina polipropylenowa typu melt blown, - Włóknina osłonowa, - Zawór wydechowy, - Zapinki taśm nagłowia, - Taśma nagłowia","op (10szt)"]
[38,"Nawilżacz powietrza NU 5N","4 poziomy intensywności nawilżania, Automatyczna kontrola wilgotności, Demontowany zasobnik wody 5,2 l, Funkcja jonizacji","szt"]
[39,"Odświeżacz powietrza AMBI PUR, zapach kwiatowy, 300 ml","Wypełnia pomieszczenie zapachem najpiękniejszego wiosennego bukietu Pojemność: 300 ml Jednostka sprzedaży: 1 sztuka Opakowanie zbiorcze: 6 sztuk","szt"]
[40,"Odświeżacz powietrza BRISE w sprayu","Odświeżając pomieszczenia pozostawia przyjemny zapach Pojemność: 300 ml Jednostka sprzedaży: 1 sztuka ","szt."]
[41,"Odświeżacz powietrza BRISE w żelu, miks zapachów","Masa netto: 150 g Miks zapachów Jednostka sprzedaży: 1 sztuka ","szt."]
[42,"Odświeżacz powietrza GREEN FRESH, 400 ml","Skutecznie neutralizuje i pochłania nieprzyjemne zapachy\nOdświeża i nawilża powietrze, pozostawiając w pomieszczeniu uczucie świeżości i czystości Pojemność: 400 ml Jednostka sprzedaży: 1 sztuka","op. (400 ml)"]
[43,"Patyczki zapachowe PACHNĄCA SZAFA, Słoneczne popołudnie, 50 ml","Patyczki zapachowe PACHNĄCA SZAFA nadają przyjemny i odświeżający zapach w każdym pomieszczeniu. Odświeżać ma bardzo ładną formę eleganckich patyczków w szklanym flakoniku.","op (50 ml)"]
[44,"Wkład do odświeżacza AMBI PUR, zapach ocean and wind","Wkład do elektrycznego odświeżacza powietrza AMBI PUR (6.630.347) Wydajność wkładów: do 80 dni Jednostka sprzedaży: 1 sztuka ","szt"]
[45,"Papier toaletowy CLASSIC, biały, 8 rolek","Papier toaletowy CLASSIC, biały, 8 rolek Wymiary listka: szer. 100 x dł. 112 mm, Szerokość taśmy: 100 mm","op. (8 rolek)"]
[46,"Papier toaletowy ELLIS PROFESSIONAL JUMBO 130/2, 12 rolek","Papier do użytku profesjonalnego w pomieszczeniach o zwiększonym natężeniu użytkowania, Materiał: celuloza dwuwarstwowa, Gramatura: 2 x 16 g/m², Długość roli: 120 m; średnica roli: 19 cm; średnica gilzy: 6 cm","op (12 rolek)"]
[47,"Papier toaletowy KATRIN 11296 PLUS 160, biały, 8 rolek","Papier toaletowy KATRIN 11296 PLUS 160, biały, 8 rolek Gramatura: 2 x 16,5 g/m², Długość jednej rolki: 18,3 m","op. (8 rolek)"]
[48,"Supermocny Plaster do cięcia VISCOPLAST, 1 m x 8 cm","Opatrunek włókninowy o wysokiej chłonności, Plaster natychmiast przykleja się do skóry, nawet do wilgotnej, Ogranicza przywieranie opatrunku do rany","op (1m)"]
[49,"Uniwersalny zestaw plastrów 3M VISCOPLAST, 24 sztuki","Plastry z opatrunkiem do opatrywania drobnych ran i skaleczeń Hypoalergiczne i wodoodporne Przepuszczające powietrze W opakowaniu 24 plastry: plastry Minifol: 72 x 25 mm - 4 sztuki, 72 x 19 mm - 8 sztuk, 57 x 16 mm - 6 sztuk, 38x10 mm - 4 sztuki Plaster Prestopor 10 x 6 cm Plaster Prestovis Plus 10 x 6 cm Jednostka sprzedaży: 1 opakowanie","op. ( 24 szt)"]
[50,"Krem do rąk EVELINE ''Niewidzialne rękawiczki'', 100 ml","Odżywczo-ochronny krem do rąk z formułą witaminową Polecany do suchych i podrażnionych dłoni Pojemność: 100 ml Jednostka sprzedaży: 1 sztuka ","op do (100 ml)"]
[51,"Krem do rąk GARNIER do skóry bardzo suchej, 100 g","Regeneruje i odżywia zniszczoną skórę dłoni Zawiera alantoinę, glicerynę oraz czynnik filtrującyJednostka sprzedaży: 1 sztuka (100 g)","op. (100 g)"]
[52,"Ręcznik MALFINI, chabrowy, 70x140 cm","Tkana metka, która może również służyć jako wieszaczek, Ozdobiony wyszywaną bordiurą po obu brzegach, Sklad: 100% bawełna, frotte, Gramatura: 450g/m², Kolor: chabrowy, Rozmiar: 70x140 cm","szt"]
[53,"Ręcznik MALFINI, granatowy, 50x100 cm","Tkana metka, która może również służyć jako wieszaczek, Ozdobiony wyszywaną bordiurą po obu brzegach, Sklad: 100% bawełna, frotte, Gramatura: 450g/m², Kolor: granatowy","szt"]
[54,"Ręcznik MALFINI, szaro-czarny, 50x100 cm","Wykonane z wysokiej jakości frotte, odpowiednie pod haft, Miękkie, miłe w dotyku, dobrze absorbują wodę, Tkana metka, która może również służyć jako wieszaczek, Ozdobiony wyszywaną bordiurą po obu brzegach, Sklad: 100% bawełna, frotte, Gramatura: 450g/m² kolor szaroczany ","szt"]
[55,"Ręcznik MALFINI, szaro-czarny, 70x140 cm","Tkana metka, która może również służyć jako wieszaczek, Ozdobiony wyszywaną bordiurą po obu brzegach, Sklad: 100% bawełna, frotte, Gramatura: 450g/m², Kolor: szaroczarny Rozmiar: 70x140 cm","szt"]
[56,"Chusteczki higieniczne VELVET, 120 sztuk","Chusteczki higieniczne VELVET, 120 sztuk. W opakowaniu 120 sztuk, Produkt ma atest PZH, ","op (120 szt)"]
[57,"Ręcznik w roli ESTIMO 100/2, 500 listków","Wytrzymały, dwuwarstwowy ręcznik w 100% wykonany z celulozy o wysokich parametrach i pięknym designie Długość rolki: 100 m W rolce 500 odcinków o wymiarach: 20,3 x 20 cm Kolor biały Jednostka sprzedaży: 1 rolka ","op. (rolka 100 m)"]
[58,"Ręczniki papierowe białe, składka V, 20 x 200 listków","Gofrowane ręczniki w składce Kompatybilne ze standardowymi dozownikami do ręczników typu ZZ Materiał: makulatura jednowarstwowa Wymiary listka: 25 x 23 cm Gramatura: 1 x 30 g/m² Ilość bind w opakowaniu: 20 Ilość listków w bindzie: 200 Kolor: biały Jednostka sprzedaży: 1 karton (4000 listków)","op. (20 x 200 listków)"]
[59,"Ręczniki papierowe MERIDA składka V, 20 x 160 listków","Gofrowane ręczniki w składce wysokiej chłonności Kompatybilne ze standardowymi dozownikami do ręczników typu ZZ Materiał: makulatura dwuwarstwowa Wymiary listka: 25 x 23 cm Gramatura:2 x 19 g/m² Tłoczenie: nie Ilość bind w opakowaniu: 20 Ilość listków w bindzie: 160 Kolor: biały Jednostka sprzedaży: 1 karton (3200 listków)","op. (20 x 160 listków)"]
[60,"Ręczniki papierowe zielone, składka V, 20 x 200 listków","Gofrowane ręczniki w składce wysokiej chłonności Kompatybilne ze standardowymi dozownikami do ręczników typu ZZ Materiał: makulatura dwuwarstwowa Wymiary listka: 25 x 23 cm Gramatura:2 x 19 g/m² Tłoczenie: nie Ilość bind w opakowaniu: 20 Ilość listków w bindzie: 160 Kolor: zielon. Jednostka sprzedaży: 1 karton (3200 listków)","op. (20 x 200 listków)"]
[61,"Ręczniki w roli TORK UNIVERSAL Extra Długie do systemu TORK Matic H1, 6 rolek","Materiał: makulatura jednowarstwowa, Tłoczenie: nie, Ilość listków:1120, Długość roli: 280 m; wysokość roli: 21 cm; średnica roli: 19 cm; średnica gilzy: 3,8 cm","op. (1120 listków)"]
[62,"Rękawice antystatyczne ANSELL HyFlex® 11-800, rozmiar 9, para","Nylonowe rękawice z powłoką z pianki nitrylowej, wykonane w technologii KnitZonz™ Wszechstronne rozwiązanie do precyzyjnego montażu i prac ogólnych Zaawansowana technologia dziania zapewnia większą rozciągliwość i elastyczność w miejscach o zwiększonym nacisku Antystatyczne, zgodne z normą EN 1149 Norma EN 388 3131 (EN 388:2016 3131A) Rozmiar: 9 Jednostka sprzedaży: 1 para ","op. (1 para)"]
[63,"Rękawice DELTAPLUS VV835 Chemsafe, rozmiar 11, para","Rękawica z podwójną powłoką nitrylową na wkładzie z poliamidu, Trzecia powłoka z szorstkiej pianki nitrylowej na stronie chwytnej i końcach palców, Długość: 35 cm, Grubość: 1,15 mm - 1,30 mm na stronie chwytnej","op, 1 (para)"]
[64,"Rękawice nitrylowe MEDASEPT PF, czarne, rozmiar S, 100 sztuk","Uniwersalne, rękawice pasujące na prawą i lewą dłoń, Nitrylowe, Tekstura na końcach palców, Rozmiar S","op. (100 szt)"]
[65,"Rękawice nitrylowe MEDASEPT PREMIER, niebieskie, rozmiar XL, 100 sztuk","Rękawice nitrylowe diagnostyczne i ochronne (kat. III), Bezpudrowe., Uniwersalny kształt pasuje na obie dłonie, Tekstura na końcach palców, Przeznaczone do kontaktu z żywnością.","op. (100 szt)"]
[66,"Rękawice nitrylowe MEDASEPT PRIME, niebieskie, rozmiar L, 100 sztuk","Rękawice nitrylowe diagnostyczne i ochronne, Bezpudrowe. Uniwersalny kształt pasuje na obie dłonie. ","op. (100 szt)"]
[67,"Rękawice nitrylowe MEDASEPT PRIME, niebieskie, rozmiar M, 100 sztuk","Rękawice nitrylowe diagnostyczne i ochronne","op. (100 szt)"]
[68,"Ręcznik kuchenny VELVET Jumbo, 1 rolka","Dwuwarstwowy ręcznik papierowy, który świetnie nadaje się do generalnych porządków, prac w garażu, ogrodzie oraz w kuchni Giga rola = 13 standardowych rolek Nie tylko chłonny i wytrzymały, ale także wyjątkowo wydajny Jedna rolka zawiera aż 520 listków Wysokość rolki: 22 cm Kolor biały Jednostka sprzedaży: 1 rolka ","szt ( 1 rolka)"]
[69,"Ręcznik papierowy BRATEK biały, 2 rolki","Ręczniki kuchenne, dwuwarstwowe, celulozowe Szerokość rolki: 22 cm Długość rolki: 11 m Jednostka sprzedaży: 1 opakowanie (2 sztuki)","op (2 rolki)"]
[70,"Ręczniki kuchenne AHA, 2 rolki","Dwuwarstwowy ręcznik wykonany z czystej celulozy W rolce 50 odcinków o wymiarach: 23 x 20 cm W opakowaniu: 2 rolki Kolor biały Jednostka sprzedaży: 1 opakowanie ","op (2 rolki)"]
[71,"Ręczniki kuchenne VELVET, 2 rolki","Produkt wolny od bisfenolu A (BPA FREE), posiada atest NIZP-PZH","op. (2 rolki)"]
[72,"Łyżeczki do herbaty AMEFA Bologna, 12 sztuk","subtelne i eleganckie łyżeczki do herbaty, Sztućce polerowane, stal 18/0","op (12 szt)"]
[73,"Łyżeczki do kawy AMEFA Bologna, 12 sztuk","Klasyczne, proste w formie, subtelne i eleganckie łyżeczki do kawy Dobra jakość w atrakcyjnej cenie powodują, iż linia od lat cieszy się wyjątkową popularnością  Sztućce polerowane, stal 18/0","op (12 szt)"]
[74,"Łyżki AMEFA Bologna, 12 sztuk","Sztućce polerowane, stal 18/0","op (12 szt)"]
[75,"Widelce AMEFA Bologna, 12 sztuk","\nSztućce polerowane, stal 18/0, ","op (12 szt)"]
[76,"Ściereczki mokre do mebli drewnianych PRESTO, opakowanie 72 sztuki","Ściereczki nawilżane do czyszczenia różnych powierzchni, Usuwają kurz i zapobiegają jego osadzaniu, Nadają połysk czyszczonym powierzchniom","op. (72 szt)"]
[77,"Kulki do toalet BREF Power Activ, 50 g, zapach cytrynowy","Nowoczesne rozwiązanie w postaci czterech kulek na wygodnej zawieszce Czyszczą, pozostawiają przyjemny zapach i chronią przed osadzaniem się kamienia Masa netto: 50 g Jednostka sprzedaży: 1 sztuka Opakowanie zbiorcze: 10 sztuk","op. (50 g)"]
[78,"Kulki do toalet BREF Power Activ, 50 g, zapach morski","Nowoczesne rozwiązanie w postaci czterech kulek na wygodnej zawieszce Czyszczą, pozostawiają przyjemny zapach i chronią przed osadzaniem się kamienia Masa netto: 50 g Jednostka sprzedaży: 1 sztuka ","op. (50 g)"]
[79,"Płyn CILIT Bang Kamień i brud, 750 ml","Żel CILIT kamień i brud z Turbo Power. Do czyszczenia wanien, kabin prysznicowych, płytek, toalet, armatury kuchennej i łazienkowej Usuwa kamień, rdzawe zacieki z twardej wody, osad z mydła i inne zabrudzenia Pojemność: 750 ml Jednostka sprzedaży: 1 sztuka","op. (750 ml)"]
[80,"Płyn do toalet DOMESTOS Toilet Limescale Remover, 750 ml","Gęsty płyn do czyszczenia muszli klozetowych Formuła ściśle przylegająca do czyszczonych powierzchni, rozpuszcza kamień wapienny Przeznaczony do powierzchni porcelanowych i szkliwionych Butelka z wygodnym dozownikiem Pojemność: 750 ml Jednostka sprzedaży: 1 sztuka Opakowanie zbiorcze: 6 sztuk","op. (750 ml)"]
[81,"Płyn do WC DOMESTOS 24H, 1,25 l, cytrynowy","Produkt czyszcząco-dezynfekująco-wybielający Możliwość stosowania do: muszli klozetowych, umywalek, zlewów itp. Produkt nadaje się także do wybielania tkanin Jednostka sprzedaży: 1 sztuka Pojemność: 1,25 l ","op. (1,25 l)"]
[82,"Płyn do WC DOMESTOS 24H, 1,25 l, leśny","Produkt czyszcząco-dezynfekująco-wybielający Możliwość stosowania do: muszli klozetowych, umywalek, zlewów itp. Produkt nadaje się także do wybielania tkanin Pojemność: 1,25 l Jednostka sprzedaży: 1 sztuka ","op. (1,25 l)"]
[83,"Wkład zapachowy do pisuarów MERIDA, czerwony","Winylowy, elastyczny wkład zapachowy do pisuarów, Zapach utrzymuje się przez około 30 dni, Dodatkowo wkład zabezpiecza pisuar przed zapchaniem","szt."]
[84,"Zawieszka do WC DOMESTOS, zapach leśny","Zawieszki czyszczące do toalet Chronią przed osadzaniem się kamienia i pozostawiają świeży zapach Jednostka sprzedaży 1 sztuka ","szt"]
[85,"Żel BREF do WC Fresh Mist, 700 ml","Usuwa kamień, brud i osad, Gęsta formuła żelu sprawia, że działa on również pod powierzchnią wody.","op. (700 ml)"]
[86,"Żel CLINEX Drill do udrażniania odpływów, 1 l","Szybko rozpuszcza wszelkie stałe i organiczne zanieczyszczenia takie jak: tłuszcz, papier, wata, odpadki kuchenne, Forma żelowa pozwala na osadzanie się preparatu na ściankach rur, przedłużając proces działania, Likwiduje nieprzyjemne zapachy, Nadaje się do udrażniania rur zarówno w kuchni, jak i w łazience","op. (1 l)"]
[87,"Biobójczy płyn do dezynfekcji rąk HISKIN, 1 l","Produkt przeznaczony do codziennego stosowania przez użytkownika powszechnego. Wykazuje działanie bakteriobójcze, grzybobójcze i wirusobójcze","op. (1 l)"]
[88,"Dozownik do mydła w płynie MERIDA TOP, biały","Mocny i trwały dozownik do mydła w płynie wykonany z tworzywa ABS Okienko umożliwiające kontrolę zużycia mydła Pojemność: 0,8 l Zestaw do montażu w komplecie Wymiary: dł. 11,5 x szer.11,5 x wys. 25 cm Kolor: biały Jednostka sprzedaży: 1 sztuka","szt."]
[89,"Mydło toaletowe NIVEA, 100 g","Kremowe mydło z odżywczym olejkiem migdałowym Miks zapachów Jednostka sprzedaży: 1 sztuka ","szt. (100 g)"]
[90,"Mydło w płynie MERIDA Silva, 5 l","Mydło w płynie typu „dwa w jednym”, Zawiera m.in. glukopony mające doskonałe właściwości pielęgnacyjne skóry, jak również gluadyny – roślinne proteiny, szczególnie cenne składniki pielęgnacyjne chroniące skórę i włosy","op. (5l)"]
[91,"Mydło w płynie PALMOLIVE, migdałowe, 300 ml","Dzięki naturalnemu pH nie podrażnia nawet wrażliwej skóry Zawiera kombinację substancji czyszczących i odżywczych Opakowanie z dozownikiem Pojemność 300 ml Jednostka sprzedaży: 1 sztuka Opakowanie zbiorcze: 12 sztuk","op. (300 ml)"]
[92,"Pasta BHP do rąk, ścierna, 500 g","Usuwa silne zabrudzenia smarami, tłuszczami, sadzami","op. (500g)"]
[93,"Pasta do rąk MERIDA PA12, 500 ml","Usuwa wszelkie zabrudzenia nawet powstałe od smarów i olejów, Oszczędna w użyciu, Jest niealkaliczna i nie zawiera mineralnych środków ściernych","op. (500 ml)"]
[94,"Kapsułki do zmywarek FAIRY Jar All in 1, 115 kapsułek","Wydajne kapsułki do maszynowego mycia naczyń Jednostka sprzedaży: 1 opakowanie (115 kapsułek) ","op. ( 115 szt)"]
[95,"Płyn do czyszczenia zmywarek FINISH, 250 ml","Płyn do czyszczenia zmywarek o zapachu cytrynowym Pojemność: 250 ml Jednostka sprzedaży 1 opakowanie","op (250 ml)"]
[96,"Płyn do mycia naczyń LUDWIK 1150 g","Posiada bardzo dobre właściwości myjące oraz wysoką zdolność do emulgowania tłuszczów zarówno w ciepłej, jak i zimnej wodzie. Nie pozostawia zacieków na umytych powierzchniach, nadaje im połysk bez konieczności wycierania do sucha. Nowa receptura została również wzbogacona kompleksem witamin A,E,F,H, mającym działanie ochronne i odżywcze dla skóry rąk, Polecany również do mycia mebli, lodówek, wykładzin, podłóg, glazury, dywanów i tworzyw sztucznych","op. (1150 g)"]
[97,"Płyn do mycia naczyń LUDWIK cytrynowy, 5 kg","Posiada bardzo dobre właściwości myjące oraz wysoką zdolność do emulgowania tłuszczów zarówno w ciepłej, jak i zimnej wodzie. Nie pozostawia zacieków na umytych powierzchniach, nadaje im połysk bez konieczności wycierania do sucha. Nowa receptura została również wzbogacona kompleksem witamin A,E,F,H, mającym działanie ochronne i odżywcze dla skóry rąk, Polecany również do mycia mebli, lodówek, wykładzin, podłóg, glazury, dywanów i tworzyw sztucznych","5 kg"]
[98,"Płyn do mycia naczyń LUDWIK Miętowy 1 l.","Posiada bardzo dobre właściwości myjące oraz wysoką zdolność do emulgowania tłuszczów zarówno w ciepłej, jak i zimnej wodzie. Nie pozostawia zacieków na umytych powierzchniach, nadaje im połysk bez konieczności wycierania do sucha. Nowa receptura została również wzbogacona kompleksem witamin A,E,F,H, mającym działanie ochronne i odżywcze dla skóry rąk, Polecany również do mycia mebli, lodówek, wykładzin, podłóg, glazury, dywanów i tworzyw sztucznych","op. (1 l)"]
[99,"Płyn do mycia naczyń LUDWIK, cytrynowy, 450 g","Posiada bardzo dobre właściwości myjące oraz wysoką zdolność do emulgowania tłuszczów zarówno w ciepłej, jak i zimnej wodzie. Nie pozostawia zacieków na umytych powierzchniach, nadaje im połysk bez konieczności wycierania do sucha. Nowa receptura została również wzbogacona kompleksem witamin A,E,F,H, mającym działanie ochronne i odżywcze dla skóry rąk, Polecany również do mycia mebli, lodówek, wykładzin, podłóg, glazury, dywanów i tworzyw sztucznych","op. (450g)"]
[100,"Płyn do naczyń LUDWIK, 450 g, miętowy"," Nie pozostawia zacieków na umytych powierzchniach, nadaje im połysk bez konieczności wycierania do sucha. Polecany również do mycia mebli, lodówek, wykładzin, podłóg, glazury, dywanów i tworzyw sztucznych.","op.(450g)"]
[101,"Płyn nabłyszczający do zmywarek LUDWIK, 750 ml","Przeznaczony do płukania i nabłyszczania naczyń zmywanych w zmywarce Dzięki właściwie dobranym składnikom i zawartości kwasku cytrynowego płyn sprawia, że myte naczynia wysychają bez plam i zacieków Jednostka sprzedaży: 1 opakowanie (750 ml)","op. (750 ml)"]
[102,"Płyn nabłyszczający FINISH, 400 ml","Usuwa ślady po kroplach wody i osad z kamienia, pozostawiając Diamentowy Połysk Jednostka sprzedaży: 1 opakowanie (400 ml)","op. (400 ml)"]
[103,"Sól ochronna do zmywarki LUDWIK, 1,5 kg","Preparat chroniący zmywarkę przed osadzaniem się kamienia w jej wnętrzu i na mytych naczyniach Skutecznie zmiękcza wodę dzięki zastosowanej formule, preparat zawiera całkowicie rozpuszczalną szlachetną sól z granulkami o odpowiedniej wielkości Regularne stosowanie soli ochronnej Ludwik zapewnia prawidłowe funkcjonowanie zmywarki i długotrwałą ochronę jej mechanizmów Jednostka sprzedaży: 1 opakowanie (1,5 kg)","op. (1 l)"]
[104,"Sól SOMAT do zmywarek, 1,5 kg","Zabezpiecza zmywarkę oraz naczynia przed osadzaniem się kamienia Wygodna w użyciu sól ma postać granulek Opakowanie: 1,5 kg Jednostka sprzedaży: 1 sztuka ","op. (5 kg)"]
[105,"Tabletki do zmywarek LUDWIK, 30 sztuk","Wielofunkcyjne tabletki czyszczą, nabłyszczają, chronią szkło i stal nierdzewną przed matowieniem oraz zabezpieczają zmywarkę przed osadzaniem się kamienia Funkcja zmiękczania wody pozwala na jeszcze bardziej efektywne wykorzystanie składników myjących Enzymy są aktywne już w 30°C Cytrusowy aromat tabletek nadaje długotrwały zapach świeżości w kuchni Zapewniają oszczędność wody i energii Jednostka sprzedaży: 1 opakowanie (20 g x 30 tabletek)","op. (30 szt)"]
[106,"Płyn do mycia szyb i glazury LUDWIK grapefruit z octem, 750 ml","Nie pozostawia smug, zacieków i szybko odparowuje., Skład: do 5% anionowe środki powierzchniowo czynne, konserwant (2-bromo-2-nitropropane-1,3-diol, methylchloroisothiazolinone, methylisothiazolinone), kompozycja zapachowa (limonene, linalool).","op. (750ml)"]
[107,"Płyn do mycia szyb KUBUŚ z atomizerem, 1 l","Przeznaczony do mycia szyb okiennych, luster oraz innych powierzchni szklanych, Doskonale usuwa brud, nie pozostawia smug","op. (1 l)"]
[108,"Płyn do szyb i luster BUZIL G522 Profiglass, 600 ml","Gotowy do użycia środek do mycia szyb i luster Skutecznie usuwa zabrudzenia, również te tłuste\nButelka posiada specjalnie przyciętą końcówkę rozpryskującą, która ułatwia nanoszenie środka czyszczącego Wygodna butelka 600 ml ze spryskiwaczem","op (600 ml)"]
[109,"Mleczko do czyszczenia CIF Regular Cream, 650 ml/780 g","Uniwersalne mleczko CIF z mikrokryształkami, które pomaga utrzymać powierzchnie w czystości, jest delikatne i nie rysuje powierzchni. Usuwa najbardziej oporny brud taki jak: przypieczony tłuszcz, przypalone jedzenie, plamy z kamienia w łazience. Składniki: do 5% anionowe środki powierzchniowo, czynne niejonowe środki powierzchniowo czynne, mydło, kompozycja zapachowa Limonene, Benzisothiazolinone, Linalool, Butylphenyl Methylpropional, Hexyl Cinnamal. Sposób użycia: nanieść na wilgotną ściereczkę lub bezpośrednio na czyszczoną powierzchnię. Po wyczyszczeniu dokładnie spłukać. Nie połykać. Mleczko do czyszczenia powierzchni twardych.","op (650 ml)"]
[110,"Czajnik elektryczny TEFAL Express 1,5 l, biały","Czajnik z ukrytym elementem grzejnym i obrotową podstawą, Filtr antywapienny i dwustronny wskaźnik poziomu wody, Możliwość zagotowania minimalnej ilości wody (250 ml), Pojemność: 1,5 l","szt."]
[111,"Dzbanek filtrujący wodę AQUAPHOR Onyx 4,2 l + 3 wkłady filtrujące, biały","Klasyczny i elegancki kształt pasuje do biur i sal konferencyjnych, Produkt wolny od bisfenolu A (BPA FREE), posiada atest NIZP-PZH, W zestawie 3 wkłady Maxfor MG wzbogacające wodę w magnez","op. (3 szt.)"]
[112,"Filtr wody KRUPS F08801 do ekspresu ciśnieniowego, 1 sztuka","Zapobiega nadmiernemu osadzaniu się kamienia Dostosowany do ekspresów Krups Artese oraz Krups Orchestro Jednostka sprzedaży: 1 sztuka","szt"]
[113,"Termos TEFAL Campo, 1 l, czarny","Termos TEFAL Campo, 1 l, czarnyObudowa ze stali nierdzewnej z kolorową powłoką z wkładką szklaną, Kolor: czarny","szt"]
[114,"Reklamówki foliowe 9 micronów 210 + 2 x 60 x 435 mm (+/-12), 150 sztuk","Reklamówki o wymiarach 210 + 2 x 60 x 435 mm (+/-12) Nawój: 150 sztuk\nFolia HDPE / grubość 9 mikronówJednostka sprzedaży: 1 rolka (150sztuk)\n","op. (150 szt.)"]
[115,"Worki do segregacji 60 l, niebieskie na szkło, 60 x 72 cm","Wytrzymałe worki ułatwiające segregację śmieci dzięki kodowi kolorystycznemu, Mają nadruk informujący, jakie typy odpadów należy do nich wrzucać, a jakich nie należy, Wymiary: 60 x 72 cm","op. "]
[116,"Worki do segregacji 60 l, zielone na szkło, 60 x 72 cm","Wytrzymałe worki ułatwiające segregację śmieci dzięki kodowi kolorystycznemu, Mają nadruk informujący, jakie typy odpadów należy do nich wrzucać, a jakich nie należy, Wymiary: 60 x 72 cm","op"]
[117,"Worki do segregacji 60 l, zółte na szkło, 60 x 72 cm","Wytrzymałe worki ułatwiające segregację śmieci dzięki kodowi kolorystycznemu, Mają nadruk informujący, jakie typy odpadów należy do nich wrzucać, a jakich nie należy, Wymiary: 60 x 72 cm","op"]
[118,"Worki na śmieci LDPE sanitarne 120 l, niebieskie, 10 sztuk","Wymiary: 110 x 70 cm, Grubość: folii: 0,03 mm","op (10 szt)"]
[119,"Worki na śmieci LDPE sanitarne 160 l, czarne, 20 sztuk","Worki na śmieci LDPE sanitarne 160 l, czarne, 20 sztuk Pojemność: 160 l Wymiary: 150 x 90 cm Grubość: folii: 0,027 mm Kolor folii: czarny Jednostka sprzedaży: 1 opakowanie (20 sztuk)","op. (20 sztuk)"]
[120,"Worki na śmieci LDPE z taśmą ściągającą 60 l, czarne, 10 sztuk","Posiadają taśmę ściągającą Pojemność: 60 l Wymiary: 72 x 60 cm Grubość: folii: 0,02 mm Kolor folii: czarny Jednostka sprzedaży: 1 opakowanie (10 sztuk)","op. (10 sztuk)"]
[121,"Worki na śmieci łazienkowe, 20 l, białe, 40 sztuk","Idealne worki na odpady łazienkowe, Pojemność: 20 l, Kolor: biały, Rozmiar: 40 x 50 cm","op: (40 sztuk)"]
[122,"Worki na śmieci MDPE 35 l, niebieskie 20 sztuk","Pojemność: 35 l Wymiary: 58 x 49 cm Grubość: folii: 0,011 mm Kolor folii: niebieski Jednostka sprzedaży: 1 opakowanie (20 sztuk)","op. (20 sztuk)"]

{"sheet":"Zadanie13","index":2,"n_rows":90,"n_cols":4,"rows_kept":90,"cut":false,"hidden":true,"merged":[]}
[1,"Filtr do expresu DELONGHI 45.76X","Filtr do expresu DELONGHI 45.76X","szt"]
[2,"ODKAMIENIACZ DO EKSPRESU MELITTA 250ML","odkamieniacz do  ekspresu MELITA poj. 250 ml.","szt. (250 ml)"]
[3,"Odkamieniacz KAMIX, w proszku, 150 g","Środek do usuwania osadów z kamienia Pojemność: 150 g Jednostka sprzedaży: 1 opakowanie ","op. ( 150 g)"]
[4,"Odkamieniacz uniwersalny KAMIX, w płynie, 500 ml","Środek w płynie do usuwania osadów kamienia Pojemność: 500 ml Jednostka sprzedaży: 1 opakowanie ","op. (500 ml)"]
[5,"płyn do czyszczenia sekcji mlecznej ekspresu","Tabletki do codziennego czyszczenia sekcji mlecznej zapewniają dokładne i higieniczne użytkowanie sekcji mlecznej Jednostka sprzedaży: 1 opakowanie","op."]
[6,"Płyn odkamieniający DELONGHI \"EcoDecalk\"","odkamieniacz do  ekspresu DELONGHI ","szt.   "]
[7,"Tabletki czyszczące KRUPS XS3000, 10 sztuk","Tabletki czyszczące przeznaczone do ekspresów ciśnieniowych i przelewowych Usuwają tłuszcz i pozostałości po kawie wewnątrz ekspresu. Regularne stosowanie gwarantuje utrzymanie wysokiej jakości kawy Jednostka sprzedaży: 1 opakowanie (10 sztuk)","op (10 szt)"]
[8,"Tabletki do zmywarek FINISH All-in-1, 50 tabletek","Jego unikalna formuła łączy w sobie działanie 10 funkcji Power Actions: usuwanie zaplamień, usuwanie tłuszczu, namaczanie, usuwanie zabrudzeń po herbacie, kryształowy połyski, lśniące sztućce, ochrona przed osadzaniem się kamienia w zmywarce, aktywna ochrona szkła, ochrona srebra, usuwanie opornych zabrudzeń, Dodatkowo spełnia funkcje soli i płynu nabłyszczającego, Składniki: 5 - 15 % związki wybielające na bazie tlenu, niejonowe środki powierzchniowo czynne, do 5 % polikarboksylany, fosfoniany. Enzymy (subtylizyna, amylaza), kompozycja zapachowa.","op (50 szt)"]
[9,"UNIWERSALNY zestaw do odkamieniania ekspresów","Uniwerslany zestaw do odkamieniania ekspresów Nespresso. Ilość sztuk w opakowaniu: 2 Jednostka sprzedaży: 1 opakowanie","op"]
[10,"Apteczka VERA TOP 15 PLUS, DIN 13157, w walizce z ABS","Apteczka w walizce z tworzywa ABS. Zawiera stelaż mocujący do ściany W skład wyposażenia wchodzą: kompres zimny – 1 szt., kompres na oko – 2 szt., kompres 10 x 10 cm - 3 opakowania (po 2 sztuki) opaska elastyczna 4 m x 6 cm – 2 szt., opaska elastyczna 4 m x 8 cm – 2 szt., zestaw plastrów 10 x 6 cm (8 szt.) – 1 komplet, zestaw plastrów (14 szt.) – 1 komplet, plaster 5 m x 2,5 cm – 1 szt., opatrunek indywidualny M sterylny – 3 szt. opatrunek indywidualny G sterylny – 1 szt., opatrunek indywidualny K sterylny – 1 szt., chusta opatrunkowa 60 x 80 cm – 1 szt. chusta trójkątna – 1 szt., chusta z flizeliny (5 szt.) – 1 komplet, koc ratunkowy 160 x 210 cm – 1 szt. nożyczki 19 cm – 1 szt., rękawice winylowe – 4 szt. chusteczka dezynfekująca – 6 sztuk, ustnik do sztucznego oddychania – 1 szt., instrukcja udzielania pierwszej pomocy Skład zgodny z normą DIN 13157. Rozmiar: 330 x 235 x 125 mm Jednostka sprzedaży: 1 sztuka","szt"]
[11,"Wyposażenie apteczki DIN 13157 PLUS","Czajnik posiada filtr antywapienny, który zapobiega przedostawaniu się kamienia do szklanki, Pojemność: 1,7 l Moc: 2400 W","op"]
[12,"Chusteczki KATRIN Plus, 100 sztuk","Białe, dwuwarstwowe chusteczki higieniczne w praktycznym podajniku Testowane dermatologicznie Jednostka sprzedaży: 1 opakowanie (100 sztuk) ","op (100 szt)"]
[13,"Czajnik elektryczny TEFAL Express 1,5 l, biały","Filtr antywapienny i dwustronny wskaźnik poziomu wody, Możliwość zagotowania minimalnej ilości wody (250 ml), Pojemność: 1,5 l, Moc: 2400 W","szt"]
[14,"Czajnik elektryczny TEFAL Loft, 1,7 l, czarny","Zdejmowana pokrywa ułatwia napełnianie wodą, Czajnik posiada filtr antywapienny, który zapobiega przedostawaniu się kamienia do szklanki, Pojemność: 1,7 l, Moc: 2400 W","szt"]
[15,"Czyściwo włókninowe, wielozadaniowe do trudnych zabrudzeń TORK, 1 rolka","Jednowarstwowe, grube i mocne czyściwo wielozadaniowe non-woven (syntetyczno-celulozowe) Duża chłonność, także oleistych substancji Niskopylne i odporne na rozerwania Współpracuje z rozpuszczalnikami, ograniczając ich zużycie Polecane do stosowania w przemyśle maszynowym, poligraficznym, spożywczym  nawet do najcięższych zadań związanych z czyszczeniem Atest PZH i certyfikat ISEGA, zezwalający na stosowanie produktu w przemyśle spożywczym W wygodnym kartonie mogącym służyć jako dozownik Perforacja co 38 cm Materiał: włóknina jednowarstwowa Tłoczenie: nie Ilość listków: 280  szerokość listka: 320 mm Długość roli: 106,4 m  średnica r[...]","szt"]
[16,"Ściereczki gąbczaste niebieskie, 3 sztuki","Bardzo trwałe i chłonne ścierki gąbczaste, wzmocnione wewnętrzną bawełnianą siatką, Najlepsze do wycierania wody, zmywania powierzchni i usuwania brudu","op. (3 szt)"]
[17,"Ścierka do podłogi, 50 x 60 cm, pomarańczowa","Ścierka do podłogi, 50 x 60 cm, pomarańczowaWymiary: 50 x 60 cm, Do czyszczenia dużych powierzchni","szt"]
[18,"Ścierka z mikrofibry KOLORADO, 35 x 35 cm","Ścierka z mikrofibry przeznaczona do czyszczenia powierzchni szklanych i stosowania w łazience, Skuteczna na sucho i mokro, Nie pozostawia smug, zacieków ani kłaczków, Skład: 80% poliester, 20% poliamid (nylon)","szt"]
[19,"Ścierki uniwersalne Practi Maxi 50sztuk","Ścierki uniwersalne Practi Maxi 50sztuk rozmiar 25 x 40","op (50 szt)"]
[20,"Ścierki uniwersalne, 5 sztuk","Ścierki wielokrotnego użytku Można je prać i sterylizować Wykonane z wiskozy, pachnące Miks kolorów Wymiary: 37 x 38 cm","op (5 szt)"]
[21,"Chusteczki FELLOWES do czyszczenia ekranów, opakowanie 100szt","Chusteczki FELLOWES do czyszczenia ekranów, opakowanie 100szt","op (100 szt)"]
[22,"Płyn AJAX Floral Fiesta, 1 l","Doskonale usuwa kurz i brud, pozostawiając na długo świeży zapach Miks zapachów Pojemność: 1 l Jednostka sprzedaży 1 sztuka","op (1l)"]
[23,"Preparat do usuwania tłustego brudu VOIGT C457 Ultra Clean plus 1 l","Odtłuszczanie, gruntowne mycie bez fosforanów – Produkt do profesjonalnego zastosowania, Nie zawierający fosforanów, Usuwa zabrudzenia pochodzenia tłuszczowego i przemysłowego m.in. oleje, smary. Zalecany do: warsztatów, hal produkcyjnych, galerii handlowych, centrów logistycznych","op (1l)"]
[24,"Rozpuszczalnik do etykiet w sprayu, pojemność 200 ml","Produkt zapewnia w pełni bezpieczne usunięcie etykiet z dowolnej powierzchni, nie pozostawiając żadnych, śladów kleju. Pojemność 200 ml.","op (200 ml)"]
[25,"Gąbka do zmywania różowa, 5 sztuk","Gąbka do różnorodnych zastosowań, Kolor: różowy","op (5 szt)"]
[26,"Gąbki do zmywania standardowa, 5 sztuk","Do zmywania naczyń, szkła, ceramiki, powierzchni emaliowanych Wytrzymała Miks kolorów w opakowaniu Jednostka sprzedaży: 1 opakowanie (5 sztuk) Opakowanie zbiorcze: 18 opakowań","op (5 szt)"]
[27,"Kuchenka mikrofalowa SEVERIN 7890/7862, biała","5 poziomów mocy, Rozmrażanie w oparciu o czas i wagę, 35-minutowy timer z sygnałem akustycznym, Pokrętło regulacyjne z chromowanymi elementami, Średnica wyjmowanego talerza ok. 25,4 cm, Wysokość komory ok. 16,5 cm, Obudowa i komora lakierowana powłoką odporną na wysokie temperatur, Wymiary: szer. 43,5, gł. 34,5, wys. 25,4 cm, Moc: 700 W","szt"]
[28,"Jednorazowa maska higieniczna 3-warstwowa, niebieska, 50 sztuk","Trójwarstwowa maska higieniczna. Wykonana z włókniny polipropylenowej (100%). Materiał: Texfil 25 (Spunbond) + Texfil 25 (Spunbond) + Texfil 25 (Spunbond). Gramatura: 25 gsm + 25 gsm + 25 gsm= 75 gsm. Gumki – długość 16cm - 18cm (± 1cm).","op (50szt)"]
[29,"Półmaska FILTERSERVICE FS-623V NR D, FFP2, z zaworem, 10 sztuk","Czasza półmaski: - Igłowana włóknina poliestrowa,  - Włóknina polipropylenowa typu melt blown, - Włóknina osłonowa, - Zawór wydechowy, - Zapinki taśm nagłowia, - Taśma nagłowia","op (10szt)"]
[30,"Nawilżacz powietrza NU 5N","4 poziomy intensywności nawilżania, Automatyczna kontrola wilgotności, Demontowany zasobnik wody 5,2 l, Funkcja jonizacji","szt"]
[31,"Odświeżacz powietrza AMBI PUR, zapach kwiatowy, 300 ml","Wypełnia pomieszczenie zapachem najpiękniejszego wiosennego bukietu Pojemność: 300 ml Jednostka sprzedaży: 1 sztuka Opakowanie zbiorcze: 6 sztuk","szt"]
[32,"Odświeżacz powietrza BRISE w sprayu","Odświeżając pomieszczenia pozostawia przyjemny zapach Pojemność: 300 ml Jednostka sprzedaży: 1 sztuka ","szt."]
[33,"Odświeżacz powietrza BRISE w żelu, miks zapachów","Masa netto: 150 g Miks zapachów Jednostka sprzedaży: 1 sztuka ","szt."]
[34,"Odświeżacz powietrza GREEN FRESH, 400 ml","Skutecznie neutralizuje i pochłania nieprzyjemne zapachy\nOdświeża i nawilża powietrze, pozostawiając w pomieszczeniu uczucie świeżości i czystości Pojemność: 400 ml Jednostka sprzedaży: 1 sztuka","op. (400 ml)"]
[35,"Patyczki zapachowe PACHNĄCA SZAFA, Słoneczne popołudnie, 50 ml","Patyczki zapachowe PACHNĄCA SZAFA nadają przyjemny i odświeżający zapach w każdym pomieszczeniu. Odświeżać ma bardzo ładną formę eleganckich patyczków w szklanym flakoniku.","op (50 ml)"]
[36,"Wkład do odświeżacza AMBI PUR, zapach ocean and wind","Wkład do elektrycznego odświeżacza powietrza AMBI PUR (6.630.347) Wydajność wkładów: do 80 dni Jednostka sprzedaży: 1 sztuka ","szt"]
[37,"Supermocny Plaster do cięcia VISCOPLAST, 1 m x 8 cm","Opatrunek włókninowy o wysokiej chłonności, Plaster natychmiast przykleja się do skóry, nawet do wilgotnej, Ogranicza przywieranie opatrunku do rany","op (1m)"]
[38,"Uniwersalny zestaw plastrów 3M VISCOPLAST, 24 sztuki","Plastry z opatrunkiem do opatrywania drobnych ran i skaleczeń Hypoalergiczne i wodoodporne Przepuszczające powietrze W opakowaniu 24 plastry: plastry Minifol: 72 x 25 mm - 4 sztuki, 72 x 19 mm - 8 sztuk, 57 x 16 mm - 6 sztuk, 38x10 mm - 4 sztuki Plaster Prestopor 10 x 6 cm Plaster Prestovis Plus 10 x 6 cm Jednostka sprzedaży: 1 opakowanie","op. ( 24 szt)"]
[39,"Krem do rąk EVELINE ''Niewidzialne rękawiczki'', 100 ml","Odżywczo-ochronny krem do rąk z formułą witaminową Polecany do suchych i podrażnionych dłoni Pojemność: 100 ml Jednostka sprzedaży: 1 sztuka ","op do (100 ml)"]
[40,"Krem do rąk GARNIER do skóry bardzo suchej, 100 g","Regeneruje i odżywia zniszczoną skórę dłoni Zawiera alantoinę, glicerynę oraz czynnik filtrującyJednostka sprzedaży: 1 sztuka (100 g)","op. (100 g)"]
[41,"Ręcznik MALFINI, chabrowy, 70x140 cm","Tkana metka, która może również służyć jako wieszaczek, Ozdobiony wyszywaną bordiurą po obu brzegach, Sklad: 100% bawełna, frotte, Gramatura: 450g/m², Kolor: chabrowy, Rozmiar: 70x140 cm","szt"]
[42,"Ręcznik MALFINI, granatowy, 50x100 cm","Tkana metka, która może również służyć jako wieszaczek, Ozdobiony wyszywaną bordiurą po obu brzegach, Sklad: 100% bawełna, frotte, Gramatura: 450g/m², Kolor: granatowy","szt"]
[43,"Chusteczki higieniczne VELVET, 120 sztuk","Chusteczki higieniczne VELVET, 120 sztuk. W opakowaniu 120 sztuk, Produkt ma atest PZH, ","op (120 szt)"]
[44,"Ręcznik w roli ESTIMO 100/2, 500 listków","Wytrzymały, dwuwarstwowy ręcznik w 100% wykonany z celulozy o wysokich parametrach i pięknym designie Długość rolki: 100 m W rolce 500 odcinków o wymiarach: 20,3 x 20 cm Kolor biały Jednostka sprzedaży: 1 rolka ","op. (rolka 100 m)"]
[45,"Ręczniki papierowe białe, składka V, 20 x 200 listków","Gofrowane ręczniki w składce Kompatybilne ze standardowymi dozownikami do ręczników typu ZZ Materiał: makulatura jednowarstwowa Wymiary listka: 25 x 23 cm Gramatura: 1 x 30 g/m² Ilość bind w opakowaniu: 20 Ilość listków w bindzie: 200 Kolor: biały Jednostka sprzedaży: 1 karton (4000 listków)","op. (20 x 200 listków)"]
[46,"Rękawice antystatyczne ANSELL HyFlex® 11-800, rozmiar 9, para","Nylonowe rękawice z powłoką z pianki nitrylowej, wykonane w technologii KnitZonz™ Wszechstronne rozwiązanie do precyzyjnego montażu i prac ogólnych Zaawansowana technologia dziania zapewnia większą rozciągliwość i elastyczność w miejscach o zwiększonym nacisku Antystatyczne, zgodne z normą EN 1149 Norma EN 388 3131 (EN 388:2016 3131A) Rozmiar: 9 Jednostka sprzedaży: 1 para ","op. (1 para)"]
[47,"Rękawice nitrylowe MEDASEPT PF, czarne, rozmiar S, 100 sztuk","Uniwersalne, rękawice pasujące na prawą i lewą dłoń, Nitrylowe, Tekstura na końcach palców, Rozmiar S","op. (100 szt)"]
[48,"Rękawice nitrylowe MEDASEPT PREMIER, niebieskie, rozmiar XL, 100 sztuk","Rękawice nitrylowe diagnostyczne i ochronne (kat. III), Bezpudrowe., Uniwersalny kształt pasuje na obie dłonie, Tekstura na końcach palców, Przeznaczone do kontaktu z żywnością.","op. (100 szt)"]
[49,"Rękawice nitrylowe MEDASEPT PRIME, niebieskie, rozmiar L, 100 sztuk","Rękawice nitrylowe diagnostyczne i ochronne, Bezpudrowe. Uniwersalny kształt pasuje na obie dłonie. ","op. (100 szt)"]
[50,"Rękawice nitrylowe MEDASEPT PRIME, niebieskie, rozmiar M, 100 sztuk","Rękawice nitrylowe diagnostyczne i ochronne","op. (100 szt)"]
[51,"Ręcznik kuchenny VELVET Jumbo, 1 rolka","Dwuwarstwowy ręcznik papierowy, który świetnie nadaje się do generalnych porządków, prac w garażu, ogrodzie oraz w kuchni Giga rola = 13 standardowych rolek Nie tylko chłonny i wytrzymały, ale także wyjątkowo wydajny Jedna rolka zawiera aż 520 listków Wysokość rolki: 22 cm Kolor biały Jednostka sprzedaży: 1 rolka ","szt ( 1 rolka)"]
[52,"Ręczniki kuchenne VELVET, 2 rolki","Produkt wolny od bisfenolu A (BPA FREE), posiada atest NIZP-PZH","op. (2 rolki)"]
[53,"Łyżeczki do herbaty AMEFA Bologna, 12 sztuk","subtelne i eleganckie łyżeczki do herbaty, Sztućce polerowane, stal 18/0","op (12 szt)"]
[54,"Łyżeczki do kawy AMEFA Bologna, 12 sztuk","Klasyczne, proste w formie, subtelne i eleganckie łyżeczki do kawy Dobra jakość w atrakcyjnej cenie powodują, iż linia od lat cieszy się wyjątkową popularnością  Sztućce polerowane, stal 18/0","op (12 szt)"]
[55,"Widelce AMEFA Bologna, 12 sztuk","\nSztućce polerowane, stal 18/0, ","op (12 szt)"]
[56,"Ściereczki mokre do mebli drewnianych PRESTO, opakowanie 72 sztuki","Ściereczki nawilżane do czyszczenia różnych powierzchni, Usuwają kurz i zapobiegają jego osadzaniu, Nadają połysk czyszczonym powierzchniom","op. (72 szt)"]
[57,"Płyn CILIT Bang Kamień i brud, 750 ml","Żel CILIT kamień i brud z Turbo Power. Do czyszczenia wanien, kabin prysznicowych, płytek, toalet, armatury kuchennej i łazienkowej Usuwa kamień, rdzawe zacieki z twardej wody, osad z mydła i inne zabrudzenia Pojemność: 750 ml Jednostka sprzedaży: 1 sztuka","op. (750 ml)"]
[58,"Płyn do WC DOMESTOS 24H, 1,25 l, cytrynowy","Produkt czyszcząco-dezynfekująco-wybielający Możliwość stosowania do: muszli klozetowych, umywalek, zlewów itp. Produkt nadaje się także do wybielania tkanin Jednostka sprzedaży: 1 sztuka Pojemność: 1,25 l ","op. (1,25 l)"]
[59,"Żel CLINEX Drill do udrażniania odpływów, 1 l","Szybko rozpuszcza wszelkie stałe i organiczne zanieczyszczenia takie jak: tłuszcz, papier, wata, odpadki kuchenne, Forma żelowa pozwala na osadzanie się preparatu na ściankach rur, przedłużając proces działania, Likwiduje nieprzyjemne zapachy, Nadaje się do udrażniania rur zarówno w kuchni, jak i w łazience","op. (1 l)"]
[60,"Biobójczy płyn do dezynfekcji rąk HISKIN, 1 l","Produkt przeznaczony do codziennego stosowania przez użytkownika powszechnego. Wykazuje działanie bakteriobójcze, grzybobójcze i wirusobójcze","op. (1 l)"]
[61,"Dozownik do mydła w płynie MERIDA TOP, biały","Mocny i trwały dozownik do mydła w płynie wykonany z tworzywa ABS Okienko umożliwiające kontrolę zużycia mydła Pojemność: 0,8 l Zestaw do montażu w komplecie Wymiary: dł. 11,5 x szer.11,5 x wys. 25 cm Kolor: biały Jednostka sprzedaży: 1 sztuka","szt."]
[62,"Mydło toaletowe NIVEA, 100 g","Kremowe mydło z odżywczym olejkiem migdałowym Miks zapachów Jednostka sprzedaży: 1 sztuka ","szt. (100 g)"]
[63,"Pasta BHP do rąk, ścierna, 500 g","Usuwa silne zabrudzenia smarami, tłuszczami, sadzami","op. (500g)"]
[64,"Kapsułki do zmywarek FAIRY Jar All in 1, 115 kapsułek","Wydajne kapsułki do maszynowego mycia naczyń Jednostka sprzedaży: 1 opakowanie (115 kapsułek) ","op. ( 115 szt)"]
[65,"Płyn do czyszczenia zmywarek FINISH, 250 ml","Płyn do czyszczenia zmywarek o zapachu cytrynowym Pojemność: 250 ml Jednostka sprzedaży 1 opakowanie","op (250 ml)"]
[66,"Płyn do mycia naczyń LUDWIK 1150 g","Posiada bardzo dobre właściwości myjące oraz wysoką zdolność do emulgowania tłuszczów zarówno w ciepłej, jak i zimnej wodzie. Nie pozostawia zacieków na umytych powierzchniach, nadaje im połysk bez konieczności wycierania do sucha. Nowa receptura została również wzbogacona kompleksem witamin A,E,F,H, mającym działanie ochronne i odżywcze dla skóry rąk, Polecany również do mycia mebli, lodówek, wykładzin, podłóg, glazury, dywanów i tworzyw sztucznych","op. (1150 g)"]
[67,"Płyn do mycia naczyń LUDWIK Miętowy 1 l.","Posiada bardzo dobre właściwości myjące oraz wysoką zdolność do emulgowania tłuszczów zarówno w ciepłej, jak i zimnej wodzie. Nie pozostawia zacieków na umytych powierzchniach, nadaje im połysk bez konieczności wycierania do sucha. Nowa receptura została również wzbogacona kompleksem witamin A,E,F,H, mającym działanie ochronne i odżywcze dla skóry rąk, Polecany również do mycia mebli, lodówek, wykładzin, podłóg, glazury, dywanów i tworzyw sztucznych","op. (1 l)"]
[68,"Płyn do mycia naczyń LUDWIK, cytrynowy, 450 g","Posiada bardzo dobre właściwości myjące oraz wysoką zdolność do emulgowania tłuszczów zarówno w ciepłej, jak i zimnej wodzie. Nie pozostawia zacieków na umytych powierzchniach, nadaje im połysk bez konieczności wycierania do sucha. Nowa receptura została również wzbogacona kompleksem witamin A,E,F,H, mającym działanie ochronne i odżywcze dla skóry rąk, Polecany również do mycia mebli, lodówek, wykładzin, podłóg, glazury, dywanów i tworzyw sztucznych","op. (450g)"]
[69,"Płyn do naczyń LUDWIK, 450 g, miętowy"," Nie pozostawia zacieków na umytych powierzchniach, nadaje im połysk bez konieczności wycierania do sucha. Polecany również do mycia mebli, lodówek, wykładzin, podłóg, glazury, dywanów i tworzyw sztucznych.","op.(450g)"]
[70,"Płyn nabłyszczający do zmywarek LUDWIK, 750 ml","Przeznaczony do płukania i nabłyszczania naczyń zmywanych w zmywarce Dzięki właściwie dobranym składnikom i zawartości kwasku cytrynowego płyn sprawia, że myte naczynia wysychają bez plam i zacieków Jednostka sprzedaży: 1 opakowanie (750 ml)","op. (750 ml)"]
[71,"Płyn nabłyszczający FINISH, 400 ml","Usuwa ślady po kroplach wody i osad z kamienia, pozostawiając Diamentowy Połysk Jednostka sprzedaży: 1 opakowanie (400 ml)","op. (400 ml)"]
[72,"Sól ochronna do zmywarki LUDWIK, 1,5 kg","Preparat chroniący zmywarkę przed osadzaniem się kamienia w jej wnętrzu i na mytych naczyniach Skutecznie zmiękcza wodę dzięki zastosowanej formule, preparat zawiera całkowicie rozpuszczalną szlachetną sól z granulkami o odpowiedniej wielkości Regularne stosowanie soli ochronnej Ludwik zapewnia prawidłowe funkcjonowanie zmywarki i długotrwałą ochronę jej mechanizmów Jednostka sprzedaży: 1 opakowanie (1,5 kg)","op. (1 l)"]
[73,"Sól SOMAT do zmywarek, 1,5 kg","Zabezpiecza zmywarkę oraz naczynia przed osadzaniem się kamienia Wygodna w użyciu sól ma postać granulek Opakowanie: 1,5 kg Jednostka sprzedaży: 1 sztuka ","op. (5 kg)"]
[74,"Tabletki do zmywarek LUDWIK, 30 sztuk","Wielofunkcyjne tabletki czyszczą, nabłyszczają, chronią szkło i stal nierdzewną przed matowieniem oraz zabezpieczają zmywarkę przed osadzaniem się kamienia Funkcja zmiękczania wody pozwala na jeszcze bardziej efektywne wykorzystanie składników myjących Enzymy są aktywne już w 30°C Cytrusowy aromat tabletek nadaje długotrwały zapach świeżości w kuchni Zapewniają oszczędność wody i energii Jednostka sprzedaży: 1 opakowanie (20 g x 30 tabletek)","op. (30 szt)"]
[75,"Płyn do mycia szyb i glazury LUDWIK grapefruit z octem, 750 ml","Nie pozostawia smug, zacieków i szybko odparowuje., Skład: do 5% anionowe środki powierzchniowo czynne, konserwant (2-bromo-2-nitropropane-1,3-diol, methylchloroisothiazolinone, methylisothiazolinone), kompozycja zapachowa (limonene, linalool).","op. (750ml)"]
[76,"Płyn do szyb i luster BUZIL G522 Profiglass, 600 ml","Gotowy do użycia środek do mycia szyb i luster Skutecznie usuwa zabrudzenia, również te tłuste\nButelka posiada specjalnie przyciętą końcówkę rozpryskującą, która ułatwia nanoszenie środka czyszczącego Wygodna butelka 600 ml ze spryskiwaczem","op (600 ml)"]
[77,"Mleczko do czyszczenia CIF Regular Cream, 650 ml/780 g","Uniwersalne mleczko CIF z mikrokryształkami, które pomaga utrzymać powierzchnie w czystości, jest delikatne i nie rysuje powierzchni. Usuwa najbardziej oporny brud taki jak: przypieczony tłuszcz, przypalone jedzenie, plamy z kamienia w łazience. Składniki: do 5% anionowe środki powierzchniowo, czynne niejonowe środki powierzchniowo czynne, mydło, kompozycja zapachowa Limonene, Benzisothiazolinone, Linalool, Butylphenyl Methylpropional, Hexyl Cinnamal. Sposób użycia: nanieść na wilgotną ściereczkę lub bezpośrednio na czyszczoną powierzchnię. Po wyczyszczeniu dokładnie spłukać. Nie połykać. Mleczko do czyszczenia powierzchni twardych.","op (650 ml)"]
[78,"Czajnik elektryczny TEFAL Express 1,5 l, biały","Czajnik z ukrytym elementem grzejnym i obrotową podstawą, Filtr antywapienny i dwustronny wskaźnik poziomu wody, Możliwość zagotowania minimalnej ilości wody (250 ml), Pojemność: 1,5 l","szt."]
[79,"Dzbanek filtrujący wodę AQUAPHOR Onyx 4,2 l + 3 wkłady filtrujące, biały","Klasyczny i elegancki kształt pasuje do biur i sal konferencyjnych, Produkt wolny od bisfenolu A (BPA FREE), posiada atest NIZP-PZH, W zestawie 3 wkłady Maxfor MG wzbogacające wodę w magnez","op. (3 szt.)"]
[80,"Filtr wody KRUPS F08801 do ekspresu ciśnieniowego, 1 sztuka","Zapobiega nadmiernemu osadzaniu się kamienia Dostosowany do ekspresów Krups Artese oraz Krups Orchestro Jednostka sprzedaży: 1 sztuka","szt"]
[81,"Termos TEFAL Campo, 1 l, czarny","Termos TEFAL Campo, 1 l, czarnyObudowa ze stali nierdzewnej z kolorową powłoką z wkładką szklaną, Kolor: czarny","szt"]
[82,"Reklamówki foliowe 9 micronów 210 + 2 x 60 x 435 mm (+/-12), 150 sztuk","Reklamówki o wymiarach 210 + 2 x 60 x 435 mm (+/-12) Nawój: 150 sztuk\nFolia HDPE / grubość 9 mikronówJednostka sprzedaży: 1 rolka (150sztuk)\n","op. (150 szt.)"]
[83,"Worki do segregacji 60 l, niebieskie na szkło, 60 x 72 cm","Wytrzymałe worki ułatwiające segregację śmieci dzięki kodowi kolorystycznemu, Mają nadruk informujący, jakie typy odpadów należy do nich wrzucać, a jakich nie należy, Wymiary: 60 x 72 cm","op. "]
[84,"Worki do segregacji 60 l, zielone na szkło, 60 x 72 cm","Wytrzymałe worki ułatwiające segregację śmieci dzięki kodowi kolorystycznemu, Mają nadruk informujący, jakie typy odpadów należy do nich wrzucać, a jakich nie należy, Wymiary: 60 x 72 cm","op"]
[85,"Worki do segregacji 60 l, zółte na szkło, 60 x 72 cm","Wytrzymałe worki ułatwiające segregację śmieci dzięki kodowi kolorystycznemu, Mają nadruk informujący, jakie typy odpadów należy do nich wrzucać, a jakich nie należy, Wymiary: 60 x 72 cm","op"]
[86,"Worki na śmieci LDPE sanitarne 120 l, niebieskie, 10 sztuk","Wymiary: 110 x 70 cm, Grubość: folii: 0,03 mm","op (10 szt)"]
[87,"Worki na śmieci LDPE sanitarne 160 l, czarne, 20 sztuk","Worki na śmieci LDPE sanitarne 160 l, czarne, 20 sztuk Pojemność: 160 l Wymiary: 150 x 90 cm Grubość: folii: 0,027 mm Kolor folii: czarny Jednostka sprzedaży: 1 opakowanie (20 sztuk)","op. (20 sztuk)"]
[88,"Worki na śmieci LDPE z taśmą ściągającą 60 l, czarne, 10 sztuk","Posiadają taśmę ściągającą Pojemność: 60 l Wymiary: 72 x 60 cm Grubość: folii: 0,02 mm Kolor folii: czarny Jednostka sprzedaży: 1 opakowanie (10 sztuk)","op. (10 sztuk)"]
[89,"Worki na śmieci łazienkowe, 20 l, białe, 40 sztuk","Idealne worki na odpady łazienkowe, Pojemność: 20 l, Kolor: biały, Rozmiar: 40 x 50 cm","op: (40 sztuk)"]
[90,"Worki na śmieci MDPE 35 l, niebieskie 20 sztuk","Pojemność: 35 l Wymiary: 58 x 49 cm Grubość: folii: 0,011 mm Kolor folii: niebieski Jednostka sprzedaży: 1 opakowanie (20 sztuk)","op. (20 sztuk)"]

{"sheet":"Zadanie14","index":3,"n_rows":121,"n_cols":4,"rows_kept":121,"cut":false,"hidden":true,"merged":[]}
[1,"ODKAMIENIACZ DO EKSPRESU MELITTA 250ML","odkamieniacz do  ekspresu MELITA poj. 250 ml.","szt. (250 ml)"]
[2,"Odkamieniacz KAMIX, w proszku, 150 g","Środek do usuwania osadów z kamienia Pojemność: 150 g Jednostka sprzedaży: 1 opakowanie ","op. ( 150 g)"]
[3,"Odkamieniacz uniwersalny KAMIX, w płynie, 500 ml","Środek w płynie do usuwania osadów kamienia Pojemność: 500 ml Jednostka sprzedaży: 1 opakowanie ","op. (500 ml)"]
[4,"płyn do czyszczenia sekcji mlecznej ekspresu","Tabletki do codziennego czyszczenia sekcji mlecznej zapewniają dokładne i higieniczne użytkowanie sekcji mlecznej Jednostka sprzedaży: 1 opakowanie","op."]
[5,"Płyn odkamieniający DELONGHI \"EcoDecalk\"","odkamieniacz do  ekspresu DELONGHI ","szt.   "]
[6,"Tabletki czyszczące KRUPS XS3000, 10 sztuk","Tabletki czyszczące przeznaczone do ekspresów ciśnieniowych i przelewowych Usuwają tłuszcz i pozostałości po kawie wewnątrz ekspresu. Regularne stosowanie gwarantuje utrzymanie wysokiej jakości kawy Jednostka sprzedaży: 1 opakowanie (10 sztuk)","op (10 szt)"]
[7,"Tabletki do zmywarek FINISH All-in-1, 50 tabletek","Jego unikalna formuła łączy w sobie działanie 10 funkcji Power Actions: usuwanie zaplamień, usuwanie tłuszczu, namaczanie, usuwanie zabrudzeń po herbacie, kryształowy połyski, lśniące sztućce, ochrona przed osadzaniem się kamienia w zmywarce, aktywna ochrona szkła, ochrona srebra, usuwanie opornych zabrudzeń, Dodatkowo spełnia funkcje soli i płynu nabłyszczającego, Składniki: 5 - 15 % związki wybielające na bazie tlenu, niejonowe środki powierzchniowo czynne, do 5 % polikarboksylany, fosfoniany. Enzymy (subtylizyna, amylaza), kompozycja zapachowa.","op (50 szt)"]
[8,"UNIWERSALNY zestaw do odkamieniania ekspresów","Uniwerslany zestaw do odkamieniania ekspresów Nespresso. Ilość sztuk w opakowaniu: 2 Jednostka sprzedaży: 1 opakowanie","op"]
[9,"Wkłady filtrujące BRITA Maxtra+ Pure Performance, 3 sztuki","Wybierając wkłady filtrujące Brita Maxtra+ Pure Performance, zapewniasz sobie czystą wodę o doskonałym smaku. Zastosowane perełki węgla aktywnego skutecznie zatrzymują chlor i redukują mogące występować w wodzie zanieczyszczenia, jak herbicydy, pestycydy czy pozostałości po farmaceutykach. Z kolei perełki wymiennika jonowego zmiękczają wodę i zmniejszają występowanie metali w rodzaju miedzi i ołowiu. Wkłady filtrując są rekomendowane do wody miękkiej i średnio twardej.","op (3 szt)"]
[10,"Worki papierowe do odkurzacza MERIDA Dex, 3 sztuki","Worki papierowe do odkurzacza MERIDA Dex, 3 sztuki","op (3 szt)"]
[11,"Wymienne wkłady do filtra wody AQUAPHOR MAXFOR","Największa na rynku wydajność - do 200 l, Zawiera innowacyjne włókno Aqualen, dzięki czemu skutecznie usuwa z wody chlor, metale ciężkie, fenol, pestycydy i inne zanieczyszczenia, Redukuje twardość wody i zapobiega pojawianiu się osadu i kamienia na urządzeniach AGD np. w czajnikach i ekspresach, Produkt wolny od bisfenolu A (BPA FREE), wykonany z ekologicznych materiałów","op"]
[12,"Zestaw do odkamieniania KRUPS F054, 2 saszetki po 40 g","Zestaw polecany do ekspresów KRUPS Informacje na temat sposobu użytkowania dostępne w instrukcji obsługi ekspresu W opakowaniu: 2 saszetki środka odkamieniającego Jednostka sprzedaży: 1 opakowanie (2 saszetki x 40 g)","op (2 saszetki)"]
[13,"Apteczka VERA TOP 15 PLUS, DIN 13157, w walizce z ABS","Apteczka w walizce z tworzywa ABS. Zawiera stelaż mocujący do ściany W skład wyposażenia wchodzą: kompres zimny – 1 szt., kompres na oko – 2 szt., kompres 10 x 10 cm - 3 opakowania (po 2 sztuki) opaska elastyczna 4 m x 6 cm – 2 szt., opaska elastyczna 4 m x 8 cm – 2 szt., zestaw plastrów 10 x 6 cm (8 szt.) – 1 komplet, zestaw plastrów (14 szt.) – 1 komplet, plaster 5 m x 2,5 cm – 1 szt., opatrunek indywidualny M sterylny – 3 szt. opatrunek indywidualny G sterylny – 1 szt., opatrunek indywidualny K sterylny – 1 szt., chusta opatrunkowa 60 x 80 cm – 1 szt. chusta trójkątna – 1 szt., chusta z flizeliny (5 szt.) – 1 komplet, koc ratunkowy 160 x 210 cm – 1 szt. nożyczki 19 cm – 1 szt., rękawice winylowe – 4 szt. chusteczka dezynfekująca – 6 sztuk, ustnik do sztucznego oddychania – 1 szt., instrukcja udzielania pierwszej pomocy Skład zgodny z normą DIN 13157. Rozmiar: 330 x 235 x 125 mm Jednostka sprzedaży: 1 sztuka","szt"]
[14,"Wyposażenie apteczki DIN 13157 PLUS","Czajnik posiada filtr antywapienny, który zapobiega przedostawaniu się kamienia do szklanki, Pojemność: 1,7 l Moc: 2400 W","op"]
[15,"Chusteczki KATRIN Plus, 100 sztuk","Białe, dwuwarstwowe chusteczki higieniczne w praktycznym podajniku Testowane dermatologicznie Jednostka sprzedaży: 1 opakowanie (100 sztuk) ","op (100 szt)"]
[16,"Czajnik elektryczny TEFAL Express 1,5 l, biały","Filtr antywapienny i dwustronny wskaźnik poziomu wody, Możliwość zagotowania minimalnej ilości wody (250 ml), Pojemność: 1,5 l, Moc: 2400 W","szt"]
[17,"Czajnik elektryczny TEFAL Loft, 1,7 l, czarny","Zdejmowana pokrywa ułatwia napełnianie wodą, Czajnik posiada filtr antywapienny, który zapobiega przedostawaniu się kamienia do szklanki, Pojemność: 1,7 l, Moc: 2400 W","szt"]
[18,"Czyściwo włókninowe, wielozadaniowe do trudnych zabrudzeń TORK, 1 rolka","Jednowarstwowe, grube i mocne czyściwo wielozadaniowe non-woven (syntetyczno-celulozowe) Duża chłonność, także oleistych substancji Niskopylne i odporne na rozerwania Współpracuje z rozpuszczalnikami, ograniczając ich zużycie Polecane do stosowania w przemyśle maszynowym, poligraficznym, spożywczym  nawet do najcięższych zadań związanych z czyszczeniem Atest PZH i certyfikat ISEGA, zezwalający na stosowanie produktu w przemyśle spożywczym W wygodnym kartonie mogącym służyć jako dozownik Perforacja co 38 cm Materiał: włóknina jednowarstwowa Tłoczenie: nie Ilość listków: 280  szerokość listka: 320 mm Długość roli: 106,4 m  średnica r[...]","szt"]
[19,"Kij z mopem sznurkowym, 1 komplet","Kij z mopem sznurkowym, Waga: 345 g, Jednostka sprzedaży: 1 sztuka","szt"]
[20,"Nakładka CEG z mikrofibry na mop triple, długość 40 cm","Mop trójskładnikowy DUO (kieszeń + klips), Wykonany z bawełny, mikrowłókna i poliestru, Długość: 40 cm","szt"]
[21,"Ściereczki gąbczaste niebieskie, 3 sztuki","Bardzo trwałe i chłonne ścierki gąbczaste, wzmocnione wewnętrzną bawełnianą siatką, Najlepsze do wycierania wody, zmywania powierzchni i usuwania brudu","op. (3 szt)"]
[22,"Ścierka do podłogi, 50 x 60 cm, pomarańczowa","Ścierka do podłogi, 50 x 60 cm, pomarańczowaWymiary: 50 x 60 cm, Do czyszczenia dużych powierzchni","szt"]
[23,"Ścierka z mikrofibry KOLORADO, 35 x 35 cm","Ścierka z mikrofibry przeznaczona do czyszczenia powierzchni szklanych i stosowania w łazience, Skuteczna na sucho i mokro, Nie pozostawia smug, zacieków ani kłaczków, Skład: 80% poliester, 20% poliamid (nylon)","szt"]
[24,"Ścierki uniwersalne Practi Maxi 50sztuk","Ścierki uniwersalne Practi Maxi 50sztuk rozmiar 25 x 40","op (50 szt)"]
[25,"Ścierki uniwersalne, 5 sztuk","Ścierki wielokrotnego użytku Można je prać i sterylizować Wykonane z wiskozy, pachnące Miks kolorów Wymiary: 37 x 38 cm","op (5 szt)"]
[26,"Proszek do prania tkanin kolorowych DOSIA, 300 g","Proszek do prania tkanin kolorowych do wszystkich typów pralek i do prania ręcznego\nZawiera enzymy i aktywne składniki piorące\nNie zawiera chlorowych wybielaczy: jest delikatna dla kolorowych i ciemnych tkanin\nJednostka sprzedaży: 1 sztuka (300 g)","op (300g)"]
[27,"Proszek do prania tkanin PUROX, 5 kg","Do wszystkich typów pralek i do prania ręcznego, Jednostka sprzedaży: 1 opakowanie (5 kg), Składniki: do 5% anionowe i niejonowe środki powierzchniowo czynne, enzymy, kompozycja zapachowa, krzemiany, niejonowe środki powierzchniowo, czynne, regulatory piany, rozjaśniacze optyczne, związki wybielające na bazie tlenu","op (5 kg)"]
[28,"Chusteczki FELLOWES do czyszczenia ekranów, opakowanie 100szt","Chusteczki FELLOWES do czyszczenia ekranów, opakowanie 100szt","op (100 szt)"]
[29,"Płyn AJAX Floral Fiesta, 1 l","Doskonale usuwa kurz i brud, pozostawiając na długo świeży zapach Miks zapachów Pojemność: 1 l Jednostka sprzedaży 1 sztuka","op (1l)"]
[30,"Preparat do usuwania tłustego brudu VOIGT C457 Ultra Clean plus 1 l","Odtłuszczanie, gruntowne mycie bez fosforanów – Produkt do profesjonalnego zastosowania, Nie zawierający fosforanów, Usuwa zabrudzenia pochodzenia tłuszczowego i przemysłowego m.in. oleje, smary. Zalecany do: warsztatów, hal produkcyjnych, galerii handlowych, centrów logistycznych","op (1l)"]
[31,"Rozpuszczalnik do etykiet w sprayu, pojemność 200 ml","Produkt zapewnia w pełni bezpieczne usunięcie etykiet z dowolnej powierzchni, nie pozostawiając żadnych, śladów kleju. Pojemność 200 ml.","op (200 ml)"]
[32,"Gąbka do zmywania różowa, 5 sztuk","Gąbka do różnorodnych zastosowań, Kolor: różowy","op (5 szt)"]
[33,"Gąbki do zmywania standardowa, 5 sztuk","Do zmywania naczyń, szkła, ceramiki, powierzchni emaliowanych Wytrzymała Miks kolorów w opakowaniu Jednostka sprzedaży: 1 opakowanie (5 sztuk) Opakowanie zbiorcze: 18 opakowań","op (5 szt)"]
[34,"Kuchenka mikrofalowa SEVERIN 7890/7862, biała","5 poziomów mocy, Rozmrażanie w oparciu o czas i wagę, 35-minutowy timer z sygnałem akustycznym, Pokrętło regulacyjne z chromowanymi elementami, Średnica wyjmowanego talerza ok. 25,4 cm, Wysokość komory ok. 16,5 cm, Obudowa i komora lakierowana powłoką odporną na wysokie temperatur, Wymiary: szer. 43,5, gł. 34,5, wys. 25,4 cm, Moc: 700 W","szt"]
[35,"Jednorazowa maska higieniczna 3-warstwowa, niebieska, 50 sztuk","Trójwarstwowa maska higieniczna. Wykonana z włókniny polipropylenowej (100%). Materiał: Texfil 25 (Spunbond) + Texfil 25 (Spunbond) + Texfil 25 (Spunbond). Gramatura: 25 gsm + 25 gsm + 25 gsm= 75 gsm. Gumki – długość 16cm - 18cm (± 1cm).","op (50szt)"]
[36,"Półmaska FILTERSERVICE FS-623V NR D, FFP2, z zaworem, 10 sztuk","Czasza półmaski: - Igłowana włóknina poliestrowa,  - Włóknina polipropylenowa typu melt blown, - Włóknina osłonowa, - Zawór wydechowy, - Zapinki taśm nagłowia, - Taśma nagłowia","op (10szt)"]
[37,"Nawilżacz powietrza NU 5N","4 poziomy intensywności nawilżania, Automatyczna kontrola wilgotności, Demontowany zasobnik wody 5,2 l, Funkcja jonizacji","szt"]
[38,"Odświeżacz powietrza AMBI PUR, zapach kwiatowy, 300 ml","Wypełnia pomieszczenie zapachem najpiękniejszego wiosennego bukietu Pojemność: 300 ml Jednostka sprzedaży: 1 sztuka Opakowanie zbiorcze: 6 sztuk","szt"]
[39,"Odświeżacz powietrza BRISE w sprayu","Odświeżając pomieszczenia pozostawia przyjemny zapach Pojemność: 300 ml Jednostka sprzedaży: 1 sztuka ","szt."]
[40,"Odświeżacz powietrza BRISE w żelu, miks zapachów","Masa netto: 150 g Miks zapachów Jednostka sprzedaży: 1 sztuka ","szt."]
[41,"Odświeżacz powietrza GREEN FRESH, 400 ml","Skutecznie neutralizuje i pochłania nieprzyjemne zapachy\nOdświeża i nawilża powietrze, pozostawiając w pomieszczeniu uczucie świeżości i czystości Pojemność: 400 ml Jednostka sprzedaży: 1 sztuka","op. (400 ml)"]
[42,"Patyczki zapachowe PACHNĄCA SZAFA, Słoneczne popołudnie, 50 ml","Patyczki zapachowe PACHNĄCA SZAFA nadają przyjemny i odświeżający zapach w każdym pomieszczeniu. Odświeżać ma bardzo ładną formę eleganckich patyczków w szklanym flakoniku.","op (50 ml)"]
[43,"Wkład do odświeżacza AMBI PUR, zapach ocean and wind","Wkład do elektrycznego odświeżacza powietrza AMBI PUR (6.630.347) Wydajność wkładów: do 80 dni Jednostka sprzedaży: 1 sztuka ","szt"]
[44,"Papier toaletowy CLASSIC, biały, 8 rolek","Papier toaletowy CLASSIC, biały, 8 rolek Wymiary listka: szer. 100 x dł. 112 mm, Szerokość taśmy: 100 mm","op. (8 rolek)"]
[45,"Papier toaletowy ELLIS PROFESSIONAL JUMBO 130/2, 12 rolek","Papier do użytku profesjonalnego w pomieszczeniach o zwiększonym natężeniu użytkowania, Materiał: celuloza dwuwarstwowa, Gramatura: 2 x 16 g/m², Długość roli: 120 m; średnica roli: 19 cm; średnica gilzy: 6 cm","op (12 rolek)"]
[46,"Papier toaletowy KATRIN 11296 PLUS 160, biały, 8 rolek","Papier toaletowy KATRIN 11296 PLUS 160, biały, 8 rolek Gramatura: 2 x 16,5 g/m², Długość jednej rolki: 18,3 m","op. (8 rolek)"]
[47,"Supermocny Plaster do cięcia VISCOPLAST, 1 m x 8 cm","Opatrunek włókninowy o wysokiej chłonności, Plaster natychmiast przykleja się do skóry, nawet do wilgotnej, Ogranicza przywieranie opatrunku do rany","op (1m)"]
[48,"Uniwersalny zestaw plastrów 3M VISCOPLAST, 24 sztuki","Plastry z opatrunkiem do opatrywania drobnych ran i skaleczeń Hypoalergiczne i wodoodporne Przepuszczające powietrze W opakowaniu 24 plastry: plastry Minifol: 72 x 25 mm - 4 sztuki, 72 x 19 mm - 8 sztuk, 57 x 16 mm - 6 sztuk, 38x10 mm - 4 sztuki Plaster Prestopor 10 x 6 cm Plaster Prestovis Plus 10 x 6 cm Jednostka sprzedaży: 1 opakowanie","op. ( 24 szt)"]
[49,"Krem do rąk EVELINE ''Niewidzialne rękawiczki'', 100 ml","Odżywczo-ochronny krem do rąk z formułą witaminową Polecany do suchych i podrażnionych dłoni Pojemność: 100 ml Jednostka sprzedaży: 1 sztuka ","op do (100 ml)"]
[50,"Krem do rąk GARNIER do skóry bardzo suchej, 100 g","Regeneruje i odżywia zniszczoną skórę dłoni Zawiera alantoinę, glicerynę oraz czynnik filtrującyJednostka sprzedaży: 1 sztuka (100 g)","op. (100 g)"]
[51,"Ręcznik MALFINI, chabrowy, 70x140 cm","Tkana metka, która może również służyć jako wieszaczek, Ozdobiony wyszywaną bordiurą po obu brzegach, Sklad: 100% bawełna, frotte, Gramatura: 450g/m², Kolor: chabrowy, Rozmiar: 70x140 cm","szt"]
[52,"Ręcznik MALFINI, granatowy, 50x100 cm","Tkana metka, która może również służyć jako wieszaczek, Ozdobiony wyszywaną bordiurą po obu brzegach, Sklad: 100% bawełna, frotte, Gramatura: 450g/m², Kolor: granatowy","szt"]
[53,"Ręcznik MALFINI, szaro-czarny, 50x100 cm","Wykonane z wysokiej jakości frotte, odpowiednie pod haft, Miękkie, miłe w dotyku, dobrze absorbują wodę, Tkana metka, która może również służyć jako wieszaczek, Ozdobiony wyszywaną bordiurą po obu brzegach, Sklad: 100% bawełna, frotte, Gramatura: 450g/m² kolor szaroczany ","szt"]
[54,"Ręcznik MALFINI, szaro-czarny, 70x140 cm","Tkana metka, która może również służyć jako wieszaczek, Ozdobiony wyszywaną bordiurą po obu brzegach, Sklad: 100% bawełna, frotte, Gramatura: 450g/m², Kolor: szaroczarny Rozmiar: 70x140 cm","szt"]
[55,"Chusteczki higieniczne VELVET, 120 sztuk","Chusteczki higieniczne VELVET, 120 sztuk. W opakowaniu 120 sztuk, Produkt ma atest PZH, ","op (120 szt)"]
[56,"Ręcznik w roli ESTIMO 100/2, 500 listków","Wytrzymały, dwuwarstwowy ręcznik w 100% wykonany z celulozy o wysokich parametrach i pięknym designie Długość rolki: 100 m W rolce 500 odcinków o wymiarach: 20,3 x 20 cm Kolor biały Jednostka sprzedaży: 1 rolka ","op. (rolka 100 m)"]
[57,"Ręczniki papierowe białe, składka V, 20 x 200 listków","Gofrowane ręczniki w składce Kompatybilne ze standardowymi dozownikami do ręczników typu ZZ Materiał: makulatura jednowarstwowa Wymiary listka: 25 x 23 cm Gramatura: 1 x 30 g/m² Ilość bind w opakowaniu: 20 Ilość listków w bindzie: 200 Kolor: biały Jednostka sprzedaży: 1 karton (4000 listków)","op. (20 x 200 listków)"]
[58,"Ręczniki papierowe MERIDA składka V, 20 x 160 listków","Gofrowane ręczniki w składce wysokiej chłonności Kompatybilne ze standardowymi dozownikami do ręczników typu ZZ Materiał: makulatura dwuwarstwowa Wymiary listka: 25 x 23 cm Gramatura:2 x 19 g/m² Tłoczenie: nie Ilość bind w opakowaniu: 20 Ilość listków w bindzie: 160 Kolor: biały Jednostka sprzedaży: 1 karton (3200 listków)","op. (20 x 160 listków)"]
[59,"Ręczniki papierowe zielone, składka V, 20 x 200 listków","Gofrowane ręczniki w składce wysokiej chłonności Kompatybilne ze standardowymi dozownikami do ręczników typu ZZ Materiał: makulatura dwuwarstwowa Wymiary listka: 25 x 23 cm Gramatura:2 x 19 g/m² Tłoczenie: nie Ilość bind w opakowaniu: 20 Ilość listków w bindzie: 160 Kolor: zielon. Jednostka sprzedaży: 1 karton (3200 listków)","op. (20 x 200 listków)"]
[60,"Ręczniki w roli TORK UNIVERSAL Extra Długie do systemu TORK Matic H1, 6 rolek","Materiał: makulatura jednowarstwowa, Tłoczenie: nie, Ilość listków:1120, Długość roli: 280 m; wysokość roli: 21 cm; średnica roli: 19 cm; średnica gilzy: 3,8 cm","op. (1120 listków)"]
[61,"Rękawice antystatyczne ANSELL HyFlex® 11-800, rozmiar 9, para","Nylonowe rękawice z powłoką z pianki nitrylowej, wykonane w technologii KnitZonz™ Wszechstronne rozwiązanie do precyzyjnego montażu i prac ogólnych Zaawansowana technologia dziania zapewnia większą rozciągliwość i elastyczność w miejscach o zwiększonym nacisku Antystatyczne, zgodne z normą EN 1149 Norma EN 388 3131 (EN 388:2016 3131A) Rozmiar: 9 Jednostka sprzedaży: 1 para ","op. (1 para)"]
[62,"Rękawice DELTAPLUS VV835 Chemsafe, rozmiar 11, para","Rękawica z podwójną powłoką nitrylową na wkładzie z poliamidu, Trzecia powłoka z szorstkiej pianki nitrylowej na stronie chwytnej i końcach palców, Długość: 35 cm, Grubość: 1,15 mm - 1,30 mm na stronie chwytnej","op, 1 (para)"]
[63,"Rękawice nitrylowe MEDASEPT PF, czarne, rozmiar S, 100 sztuk","Uniwersalne, rękawice pasujące na prawą i lewą dłoń, Nitrylowe, Tekstura na końcach palców, Rozmiar S","op. (100 szt)"]
[64,"Rękawice nitrylowe MEDASEPT PREMIER, niebieskie, rozmiar XL, 100 sztuk","Rękawice nitrylowe diagnostyczne i ochronne (kat. III), Bezpudrowe., Uniwersalny kształt pasuje na obie dłonie, Tekstura na końcach palców, Przeznaczone do kontaktu z żywnością.","op. (100 szt)"]
[65,"Rękawice nitrylowe MEDASEPT PRIME, niebieskie, rozmiar L, 100 sztuk","Rękawice nitrylowe diagnostyczne i ochronne, Bezpudrowe. Uniwersalny kształt pasuje na obie dłonie. ","op. (100 szt)"]
[66,"Rękawice nitrylowe MEDASEPT PRIME, niebieskie, rozmiar M, 100 sztuk","Rękawice nitrylowe diagnostyczne i ochronne","op. (100 szt)"]
[67,"Ręcznik kuchenny VELVET Jumbo, 1 rolka","Dwuwarstwowy ręcznik papierowy, który świetnie nadaje się do generalnych porządków, prac w garażu, ogrodzie oraz w kuchni Giga rola = 13 standardowych rolek Nie tylko chłonny i wytrzymały, ale także wyjątkowo wydajny Jedna rolka zawiera aż 520 listków Wysokość rolki: 22 cm Kolor biały Jednostka sprzedaży: 1 rolka ","szt ( 1 rolka)"]
[68,"Ręcznik papierowy BRATEK biały, 2 rolki","Ręczniki kuchenne, dwuwarstwowe, celulozowe Szerokość rolki: 22 cm Długość rolki: 11 m Jednostka sprzedaży: 1 opakowanie (2 sztuki)","op (2 rolki)"]
[69,"Ręczniki kuchenne AHA, 2 rolki","Dwuwarstwowy ręcznik wykonany z czystej celulozy W rolce 50 odcinków o wymiarach: 23 x 20 cm W opakowaniu: 2 rolki Kolor biały Jednostka sprzedaży: 1 opakowanie ","op (2 rolki)"]
[70,"Ręczniki kuchenne VELVET, 2 rolki","Produkt wolny od bisfenolu A (BPA FREE), posiada atest NIZP-PZH","op. (2 rolki)"]
[71,"Łyżeczki do herbaty AMEFA Bologna, 12 sztuk","subtelne i eleganckie łyżeczki do herbaty, Sztućce polerowane, stal 18/0","op (12 szt)"]
[72,"Łyżeczki do kawy AMEFA Bologna, 12 sztuk","Klasyczne, proste w formie, subtelne i eleganckie łyżeczki do kawy Dobra jakość w atrakcyjnej cenie powodują, iż linia od lat cieszy się wyjątkową popularnością  Sztućce polerowane, stal 18/0","op (12 szt)"]
[73,"Łyżki AMEFA Bologna, 12 sztuk","Sztućce polerowane, stal 18/0","op (12 szt)"]
[74,"Widelce AMEFA Bologna, 12 sztuk","\nSztućce polerowane, stal 18/0, ","op (12 szt)"]
[75,"Ściereczki mokre do mebli drewnianych PRESTO, opakowanie 72 sztuki","Ściereczki nawilżane do czyszczenia różnych powierzchni, Usuwają kurz i zapobiegają jego osadzaniu, Nadają połysk czyszczonym powierzchniom","op. (72 szt)"]
[76,"Kulki do toalet BREF Power Activ, 50 g, zapach cytrynowy","Nowoczesne rozwiązanie w postaci czterech kulek na wygodnej zawieszce Czyszczą, pozostawiają przyjemny zapach i chronią przed osadzaniem się kamienia Masa netto: 50 g Jednostka sprzedaży: 1 sztuka Opakowanie zbiorcze: 10 sztuk","op. (50 g)"]
[77,"Kulki do toalet BREF Power Activ, 50 g, zapach morski","Nowoczesne rozwiązanie w postaci czterech kulek na wygodnej zawieszce Czyszczą, pozostawiają przyjemny zapach i chronią przed osadzaniem się kamienia Masa netto: 50 g Jednostka sprzedaży: 1 sztuka ","op. (50 g)"]
[78,"Płyn CILIT Bang Kamień i brud, 750 ml","Żel CILIT kamień i brud z Turbo Power. Do czyszczenia wanien, kabin prysznicowych, płytek, toalet, armatury kuchennej i łazienkowej Usuwa kamień, rdzawe zacieki z twardej wody, osad z mydła i inne zabrudzenia Pojemność: 750 ml Jednostka sprzedaży: 1 sztuka","op. (750 ml)"]
[79,"Płyn do toalet DOMESTOS Toilet Limescale Remover, 750 ml","Gęsty płyn do czyszczenia muszli klozetowych Formuła ściśle przylegająca do czyszczonych powierzchni, rozpuszcza kamień wapienny Przeznaczony do powierzchni porcelanowych i szkliwionych Butelka z wygodnym dozownikiem Pojemność: 750 ml Jednostka sprzedaży: 1 sztuka Opakowanie zbiorcze: 6 sztuk","op. (750 ml)"]
[80,"Płyn do WC DOMESTOS 24H, 1,25 l, cytrynowy","Produkt czyszcząco-dezynfekująco-wybielający Możliwość stosowania do: muszli klozetowych, umywalek, zlewów itp. Produkt nadaje się także do wybielania tkanin Jednostka sprzedaży: 1 sztuka Pojemność: 1,25 l ","op. (1,25 l)"]
[81,"Płyn do WC DOMESTOS 24H, 1,25 l, leśny","Produkt czyszcząco-dezynfekująco-wybielający Możliwość stosowania do: muszli klozetowych, umywalek, zlewów itp. Produkt nadaje się także do wybielania tkanin Pojemność: 1,25 l Jednostka sprzedaży: 1 sztuka ","op. (1,25 l)"]
[82,"Wkład zapachowy do pisuarów MERIDA, czerwony","Winylowy, elastyczny wkład zapachowy do pisuarów, Zapach utrzymuje się przez około 30 dni, Dodatkowo wkład zabezpiecza pisuar przed zapchaniem","szt."]
[83,"Zawieszka do WC DOMESTOS, zapach leśny","Zawieszki czyszczące do toalet Chronią przed osadzaniem się kamienia i pozostawiają świeży zapach Jednostka sprzedaży 1 sztuka ","szt"]
[84,"Żel BREF do WC Fresh Mist, 700 ml","Usuwa kamień, brud i osad, Gęsta formuła żelu sprawia, że działa on również pod powierzchnią wody.","op. (700 ml)"]
[85,"Żel CLINEX Drill do udrażniania odpływów, 1 l","Szybko rozpuszcza wszelkie stałe i organiczne zanieczyszczenia takie jak: tłuszcz, papier, wata, odpadki kuchenne, Forma żelowa pozwala na osadzanie się preparatu na ściankach rur, przedłużając proces działania, Likwiduje nieprzyjemne zapachy, Nadaje się do udrażniania rur zarówno w kuchni, jak i w łazience","op. (1 l)"]
[86,"Biobójczy płyn do dezynfekcji rąk HISKIN, 1 l","Produkt przeznaczony do codziennego stosowania przez użytkownika powszechnego. Wykazuje działanie bakteriobójcze, grzybobójcze i wirusobójcze","op. (1 l)"]
[87,"Dozownik do mydła w płynie MERIDA TOP, biały","Mocny i trwały dozownik do mydła w płynie wykonany z tworzywa ABS Okienko umożliwiające kontrolę zużycia mydła Pojemność: 0,8 l Zestaw do montażu w komplecie Wymiary: dł. 11,5 x szer.11,5 x wys. 25 cm Kolor: biały Jednostka sprzedaży: 1 sztuka","szt."]
[88,"Mydło toaletowe NIVEA, 100 g","Kremowe mydło z odżywczym olejkiem migdałowym Miks zapachów Jednostka sprzedaży: 1 sztuka ","szt. (100 g)"]
[89,"Mydło w płynie MERIDA Silva, 5 l","Mydło w płynie typu „dwa w jednym”, Zawiera m.in. glukopony mające doskonałe właściwości pielęgnacyjne skóry, jak również gluadyny – roślinne proteiny, szczególnie cenne składniki pielęgnacyjne chroniące skórę i włosy","op. (5l)"]
[90,"Mydło w płynie PALMOLIVE, migdałowe, 300 ml","Dzięki naturalnemu pH nie podrażnia nawet wrażliwej skóry Zawiera kombinację substancji czyszczących i odżywczych Opakowanie z dozownikiem Pojemność 300 ml Jednostka sprzedaży: 1 sztuka Opakowanie zbiorcze: 12 sztuk","op. (300 ml)"]
[91,"Pasta BHP do rąk, ścierna, 500 g","Usuwa silne zabrudzenia smarami, tłuszczami, sadzami","op. (500g)"]
[92,"Pasta do rąk MERIDA PA12, 500 ml","Usuwa wszelkie zabrudzenia nawet powstałe od smarów i olejów, Oszczędna w użyciu, Jest niealkaliczna i nie zawiera mineralnych środków ściernych","op. (500 ml)"]
[93,"Kapsułki do zmywarek FAIRY Jar All in 1, 115 kapsułek","Wydajne kapsułki do maszynowego mycia naczyń Jednostka sprzedaży: 1 opakowanie (115 kapsułek) ","op. ( 115 szt)"]
[94,"Płyn do czyszczenia zmywarek FINISH, 250 ml","Płyn do czyszczenia zmywarek o zapachu cytrynowym Pojemność: 250 ml Jednostka sprzedaży 1 opakowanie","op (250 ml)"]
[95,"Płyn do mycia naczyń LUDWIK 1150 g","Posiada bardzo dobre właściwości myjące oraz wysoką zdolność do emulgowania tłuszczów zarówno w ciepłej, jak i zimnej wodzie. Nie pozostawia zacieków na umytych powierzchniach, nadaje im połysk bez konieczności wycierania do sucha. Nowa receptura została również wzbogacona kompleksem witamin A,E,F,H, mającym działanie ochronne i odżywcze dla skóry rąk, Polecany również do mycia mebli, lodówek, wykładzin, podłóg, glazury, dywanów i tworzyw sztucznych","op. (1150 g)"]
[96,"Płyn do mycia naczyń LUDWIK cytrynowy, 5 kg","Posiada bardzo dobre właściwości myjące oraz wysoką zdolność do emulgowania tłuszczów zarówno w ciepłej, jak i zimnej wodzie. Nie pozostawia zacieków na umytych powierzchniach, nadaje im połysk bez konieczności wycierania do sucha. Nowa receptura została również wzbogacona kompleksem witamin A,E,F,H, mającym działanie ochronne i odżywcze dla skóry rąk, Polecany również do mycia mebli, lodówek, wykładzin, podłóg, glazury, dywanów i tworzyw sztucznych","5 kg"]
[97,"Płyn do mycia naczyń LUDWIK Miętowy 1 l.","Posiada bardzo dobre właściwości myjące oraz wysoką zdolność do emulgowania tłuszczów zarówno w ciepłej, jak i zimnej wodzie. Nie pozostawia zacieków na umytych powierzchniach, nadaje im połysk bez konieczności wycierania do sucha. Nowa receptura została również wzbogacona kompleksem witamin A,E,F,H, mającym działanie ochronne i odżywcze dla skóry rąk, Polecany również do mycia mebli, lodówek, wykładzin, podłóg, glazury, dywanów i tworzyw sztucznych","op. (1 l)"]
[98,"Płyn do mycia naczyń LUDWIK, cytrynowy, 450 g","Posiada bardzo dobre właściwości myjące oraz wysoką zdolność do emulgowania tłuszczów zarówno w ciepłej, jak i zimnej wodzie. Nie pozostawia zacieków na umytych powierzchniach, nadaje im połysk bez konieczności wycierania do sucha. Nowa receptura została również wzbogacona kompleksem witamin A,E,F,H, mającym działanie ochronne i odżywcze dla skóry rąk, Polecany również do mycia mebli, lodówek, wykładzin, podłóg, glazury, dywanów i tworzyw sztucznych","op. (450g)"]
[99,"Płyn do naczyń LUDWIK, 450 g, miętowy"," Nie pozostawia zacieków na umytych powierzchniach, nadaje im połysk bez konieczności wycierania do sucha. Polecany również do mycia mebli, lodówek, wykładzin, podłóg, glazury, dywanów i tworzyw sztucznych.","op.(450g)"]
[100,"Płyn nabłyszczający do zmywarek LUDWIK, 750 ml","Przeznaczony do płukania i nabłyszczania naczyń zmywanych w zmywarce Dzięki właściwie dobranym składnikom i zawartości kwasku cytrynowego płyn sprawia, że myte naczynia wysychają bez plam i zacieków Jednostka sprzedaży: 1 opakowanie (750 ml)","op. (750 ml)"]
[101,"Płyn nabłyszczający FINISH, 400 ml","Usuwa ślady po kroplach wody i osad z kamienia, pozostawiając Diamentowy Połysk Jednostka sprzedaży: 1 opakowanie (400 ml)","op. (400 ml)"]
[102,"Sól ochronna do zmywarki LUDWIK, 1,5 kg","Preparat chroniący zmywarkę przed osadzaniem się kamienia w jej wnętrzu i na mytych naczyniach Skutecznie zmiękcza wodę dzięki zastosowanej formule, preparat zawiera całkowicie rozpuszczalną szlachetną sól z granulkami o odpowiedniej wielkości Regularne stosowanie soli ochronnej Ludwik zapewnia prawidłowe funkcjonowanie zmywarki i długotrwałą ochronę jej mechanizmów Jednostka sprzedaży: 1 opakowanie (1,5 kg)","op. (1 l)"]
[103,"Sól SOMAT do zmywarek, 1,5 kg","Zabezpiecza zmywarkę oraz naczynia przed osadzaniem się kamienia Wygodna w użyciu sól ma postać granulek Opakowanie: 1,5 kg Jednostka sprzedaży: 1 sztuka ","op. (5 kg)"]
[104,"Tabletki do zmywarek LUDWIK, 30 sztuk","Wielofunkcyjne tabletki czyszczą, nabłyszczają, chronią szkło i stal nierdzewną przed matowieniem oraz zabezpieczają zmywarkę przed osadzaniem się kamienia Funkcja zmiękczania wody pozwala na jeszcze bardziej efektywne wykorzystanie składników myjących Enzymy są aktywne już w 30°C Cytrusowy aromat tabletek nadaje długotrwały zapach świeżości w kuchni Zapewniają oszczędność wody i energii Jednostka sprzedaży: 1 opakowanie (20 g x 30 tabletek)","op. (30 szt)"]
[105,"Płyn do mycia szyb i glazury LUDWIK grapefruit z octem, 750 ml","Nie pozostawia smug, zacieków i szybko odparowuje., Skład: do 5% anionowe środki powierzchniowo czynne, konserwant (2-bromo-2-nitropropane-1,3-diol, methylchloroisothiazolinone, methylisothiazolinone), kompozycja zapachowa (limonene, linalool).","op. (750ml)"]
[106,"Płyn do mycia szyb KUBUŚ z atomizerem, 1 l","Przeznaczony do mycia szyb okiennych, luster oraz innych powierzchni szklanych, Doskonale usuwa brud, nie pozostawia smug","op. (1 l)"]
[107,"Płyn do szyb i luster BUZIL G522 Profiglass, 600 ml","Gotowy do użycia środek do mycia szyb i luster Skutecznie usuwa zabrudzenia, również te tłuste\nButelka posiada specjalnie przyciętą końcówkę rozpryskującą, która ułatwia nanoszenie środka czyszczącego Wygodna butelka 600 ml ze spryskiwaczem","op (600 ml)"]
[108,"Mleczko do czyszczenia CIF Regular Cream, 650 ml/780 g","Uniwersalne mleczko CIF z mikrokryształkami, które pomaga utrzymać powierzchnie w czystości, jest delikatne i nie rysuje powierzchni. Usuwa najbardziej oporny brud taki jak: przypieczony tłuszcz, przypalone jedzenie, plamy z kamienia w łazience. Składniki: do 5% anionowe środki powierzchniowo, czynne niejonowe środki powierzchniowo czynne, mydło, kompozycja zapachowa Limonene, Benzisothiazolinone, Linalool, Butylphenyl Methylpropional, Hexyl Cinnamal. Sposób użycia: nanieść na wilgotną ściereczkę lub bezpośrednio na czyszczoną powierzchnię. Po wyczyszczeniu dokładnie spłukać. Nie połykać. Mleczko do czyszczenia powierzchni twardych.","op (650 ml)"]
[109,"Czajnik elektryczny TEFAL Express 1,5 l, biały","Czajnik z ukrytym elementem grzejnym i obrotową podstawą, Filtr antywapienny i dwustronny wskaźnik poziomu wody, Możliwość zagotowania minimalnej ilości wody (250 ml), Pojemność: 1,5 l","szt."]
[110,"Dzbanek filtrujący wodę AQUAPHOR Onyx 4,2 l + 3 wkłady filtrujące, biały","Klasyczny i elegancki kształt pasuje do biur i sal konferencyjnych, Produkt wolny od bisfenolu A (BPA FREE), posiada atest NIZP-PZH, W zestawie 3 wkłady Maxfor MG wzbogacające wodę w magnez","op. (3 szt.)"]
[111,"Filtr wody KRUPS F08801 do ekspresu ciśnieniowego, 1 sztuka","Zapobiega nadmiernemu osadzaniu się kamienia Dostosowany do ekspresów Krups Artese oraz Krups Orchestro Jednostka sprzedaży: 1 sztuka","szt"]
[112,"Termos TEFAL Campo, 1 l, czarny","Termos TEFAL Campo, 1 l, czarnyObudowa ze stali nierdzewnej z kolorową powłoką z wkładką szklaną, Kolor: czarny","szt"]
[113,"Reklamówki foliowe 9 micronów 210 + 2 x 60 x 435 mm (+/-12), 150 sztuk","Reklamówki o wymiarach 210 + 2 x 60 x 435 mm (+/-12) Nawój: 150 sztuk\nFolia HDPE / grubość 9 mikronówJednostka sprzedaży: 1 rolka (150sztuk)\n","op. (150 szt.)"]
[114,"Worki do segregacji 60 l, niebieskie na szkło, 60 x 72 cm","Wytrzymałe worki ułatwiające segregację śmieci dzięki kodowi kolorystycznemu, Mają nadruk informujący, jakie typy odpadów należy do nich wrzucać, a jakich nie należy, Wymiary: 60 x 72 cm","op. "]
[115,"Worki do segregacji 60 l, zielone na szkło, 60 x 72 cm","Wytrzymałe worki ułatwiające segregację śmieci dzięki kodowi kolorystycznemu, Mają nadruk informujący, jakie typy odpadów należy do nich wrzucać, a jakich nie należy, Wymiary: 60 x 72 cm","op"]
[116,"Worki do segregacji 60 l, zółte na szkło, 60 x 72 cm","Wytrzymałe worki ułatwiające segregację śmieci dzięki kodowi kolorystycznemu, Mają nadruk informujący, jakie typy odpadów należy do nich wrzucać, a jakich nie należy, Wymiary: 60 x 72 cm","op"]
[117,"Worki na śmieci LDPE sanitarne 120 l, niebieskie, 10 sztuk","Wymiary: 110 x 70 cm, Grubość: folii: 0,03 mm","op (10 szt)"]
[118,"Worki na śmieci LDPE sanitarne 160 l, czarne, 20 sztuk","Worki na śmieci LDPE sanitarne 160 l, czarne, 20 sztuk Pojemność: 160 l Wymiary: 150 x 90 cm Grubość: folii: 0,027 mm Kolor folii: czarny Jednostka sprzedaży: 1 opakowanie (20 sztuk)","op. (20 sztuk)"]
[119,"Worki na śmieci LDPE z taśmą ściągającą 60 l, czarne, 10 sztuk","Posiadają taśmę ściągającą Pojemność: 60 l Wymiary: 72 x 60 cm Grubość: folii: 0,02 mm Kolor folii: czarny Jednostka sprzedaży: 1 opakowanie (10 sztuk)","op. (10 sztuk)"]
[120,"Worki na śmieci łazienkowe, 20 l, białe, 40 sztuk","Idealne worki na odpady łazienkowe, Pojemność: 20 l, Kolor: biały, Rozmiar: 40 x 50 cm","op: (40 sztuk)"]
[121,"Worki na śmieci MDPE 35 l, niebieskie 20 sztuk","Pojemność: 35 l Wymiary: 58 x 49 cm Grubość: folii: 0,011 mm Kolor folii: niebieski Jednostka sprzedaży: 1 opakowanie (20 sztuk)","op. (20 sztuk)"]

{"sheet":"Zadanie15","index":4,"n_rows":118,"n_cols":4,"rows_kept":118,"cut":false,"hidden":true,"merged":[]}
[1,"Filtr do expresu DELONGHI 45.76X","Filtr do expresu DELONGHI 45.76X","szt"]
[2,"ODKAMIENIACZ DO EKSPRESU MELITTA 250ML","odkamieniacz do  ekspresu MELITA poj. 250 ml.","szt. (250 ml)"]
[3,"Odkamieniacz KAMIX, w proszku, 150 g","Środek do usuwania osadów z kamienia Pojemność: 150 g Jednostka sprzedaży: 1 opakowanie ","op. ( 150 g)"]
[4,"Odkamieniacz uniwersalny KAMIX, w płynie, 500 ml","Środek w płynie do usuwania osadów kamienia Pojemność: 500 ml Jednostka sprzedaży: 1 opakowanie ","op. (500 ml)"]
[5,"płyn do czyszczenia sekcji mlecznej ekspresu","Tabletki do codziennego czyszczenia sekcji mlecznej zapewniają dokładne i higieniczne użytkowanie sekcji mlecznej Jednostka sprzedaży: 1 opakowanie","op."]
[6,"Płyn odkamieniający DELONGHI \"EcoDecalk\"","odkamieniacz do  ekspresu DELONGHI ","szt.   "]
[7,"Tabletki czyszczące KRUPS XS3000, 10 sztuk","Tabletki czyszczące przeznaczone do ekspresów ciśnieniowych i przelewowych Usuwają tłuszcz i pozostałości po kawie wewnątrz ekspresu. Regularne stosowanie gwarantuje utrzymanie wysokiej jakości kawy Jednostka sprzedaży: 1 opakowanie (10 sztuk)","op (10 szt)"]
[8,"Tabletki do zmywarek FINISH All-in-1, 50 tabletek","Jego unikalna formuła łączy w sobie działanie 10 funkcji Power Actions: usuwanie zaplamień, usuwanie tłuszczu, namaczanie, usuwanie zabrudzeń po herbacie, kryształowy połyski, lśniące sztućce, ochrona przed osadzaniem się kamienia w zmywarce, aktywna ochrona szkła, ochrona srebra, usuwanie opornych zabrudzeń, Dodatkowo spełnia funkcje soli i płynu nabłyszczającego, Składniki: 5 - 15 % związki wybielające na bazie tlenu, niejonowe środki powierzchniowo czynne, do 5 % polikarboksylany, fosfoniany. Enzymy (subtylizyna, amylaza), kompozycja zapachowa.","op (50 szt)"]
[9,"UNIWERSALNY zestaw do odkamieniania ekspresów","Uniwerslany zestaw do odkamieniania ekspresów Nespresso. Ilość sztuk w opakowaniu: 2 Jednostka sprzedaży: 1 opakowanie","op"]
[10,"Wymienne wkłady do filtra wody AQUAPHOR MAXFOR","Największa na rynku wydajność - do 200 l, Zawiera innowacyjne włókno Aqualen, dzięki czemu skutecznie usuwa z wody chlor, metale ciężkie, fenol, pestycydy i inne zanieczyszczenia, Redukuje twardość wody i zapobiega pojawianiu się osadu i kamienia na urządzeniach AGD np. w czajnikach i ekspresach, Produkt wolny od bisfenolu A (BPA FREE), wykonany z ekologicznych materiałów","op"]
[11,"Zestaw do odkamieniania KRUPS F054, 2 saszetki po 40 g","Zestaw polecany do ekspresów KRUPS Informacje na temat sposobu użytkowania dostępne w instrukcji obsługi ekspresu W opakowaniu: 2 saszetki środka odkamieniającego Jednostka sprzedaży: 1 opakowanie (2 saszetki x 40 g)","op (2 saszetki)"]
[12,"Apteczka VERA TOP 15 PLUS, DIN 13157, w walizce z ABS","Apteczka w walizce z tworzywa ABS. Zawiera stelaż mocujący do ściany W skład wyposażenia wchodzą: kompres zimny – 1 szt., kompres na oko – 2 szt., kompres 10 x 10 cm - 3 opakowania (po 2 sztuki) opaska elastyczna 4 m x 6 cm – 2 szt., opaska elastyczna 4 m x 8 cm – 2 szt., zestaw plastrów 10 x 6 cm (8 szt.) – 1 komplet, zestaw plastrów (14 szt.) – 1 komplet, plaster 5 m x 2,5 cm – 1 szt., opatrunek indywidualny M sterylny – 3 szt. opatrunek indywidualny G sterylny – 1 szt., opatrunek indywidualny K sterylny – 1 szt., chusta opatrunkowa 60 x 80 cm – 1 szt. chusta trójkątna – 1 szt., chusta z flizeliny (5 szt.) – 1 komplet, koc ratunkowy 160 x 210 cm – 1 szt. nożyczki 19 cm – 1 szt., rękawice winylowe – 4 szt. chusteczka dezynfekująca – 6 sztuk, ustnik do sztucznego oddychania – 1 szt., instrukcja udzielania pierwszej pomocy Skład zgodny z normą DIN 13157. Rozmiar: 330 x 235 x 125 mm Jednostka sprzedaży: 1 sztuka","szt"]
[13,"Wyposażenie apteczki DIN 13157 PLUS","Czajnik posiada filtr antywapienny, który zapobiega przedostawaniu się kamienia do szklanki, Pojemność: 1,7 l Moc: 2400 W","op"]
[14,"Chusteczki KATRIN Plus, 100 sztuk","Białe, dwuwarstwowe chusteczki higieniczne w praktycznym podajniku Testowane dermatologicznie Jednostka sprzedaży: 1 opakowanie (100 sztuk) ","op (100 szt)"]
[15,"Czajnik elektryczny TEFAL Express 1,5 l, biały","Filtr antywapienny i dwustronny wskaźnik poziomu wody, Możliwość zagotowania minimalnej ilości wody (250 ml), Pojemność: 1,5 l, Moc: 2400 W","szt"]
[16,"Czajnik elektryczny TEFAL Loft, 1,7 l, czarny","Zdejmowana pokrywa ułatwia napełnianie wodą, Czajnik posiada filtr antywapienny, który zapobiega przedostawaniu się kamienia do szklanki, Pojemność: 1,7 l, Moc: 2400 W","szt"]
[17,"Czyściwo włókninowe, wielozadaniowe do trudnych zabrudzeń TORK, 1 rolka","Jednowarstwowe, grube i mocne czyściwo wielozadaniowe non-woven (syntetyczno-celulozowe) Duża chłonność, także oleistych substancji Niskopylne i odporne na rozerwania Współpracuje z rozpuszczalnikami, ograniczając ich zużycie Polecane do stosowania w przemyśle maszynowym, poligraficznym, spożywczym  nawet do najcięższych zadań związanych z czyszczeniem Atest PZH i certyfikat ISEGA, zezwalający na stosowanie produktu w przemyśle spożywczym W wygodnym kartonie mogącym służyć jako dozownik Perforacja co 38 cm Materiał: włóknina jednowarstwowa Tłoczenie: nie Ilość listków: 280  szerokość listka: 320 mm Długość roli: 106,4 m  średnica r[...]","szt"]
[18,"Kij z mopem sznurkowym, 1 komplet","Kij z mopem sznurkowym, Waga: 345 g, Jednostka sprzedaży: 1 sztuka","szt"]
[19,"Nakładka CEG z mikrofibry na mop triple, długość 40 cm","Mop trójskładnikowy DUO (kieszeń + klips), Wykonany z bawełny, mikrowłókna i poliestru, Długość: 40 cm","szt"]
[20,"Ściereczki gąbczaste niebieskie, 3 sztuki","Bardzo trwałe i chłonne ścierki gąbczaste, wzmocnione wewnętrzną bawełnianą siatką, Najlepsze do wycierania wody, zmywania powierzchni i usuwania brudu","op. (3 szt)"]
[21,"Ścierka do podłogi, 50 x 60 cm, pomarańczowa","Ścierka do podłogi, 50 x 60 cm, pomarańczowaWymiary: 50 x 60 cm, Do czyszczenia dużych powierzchni","szt"]
[22,"Ścierki uniwersalne Practi Maxi 50sztuk","Ścierki uniwersalne Practi Maxi 50sztuk rozmiar 25 x 40","op (50 szt)"]
[23,"Ścierki uniwersalne, 5 sztuk","Ścierki wielokrotnego użytku Można je prać i sterylizować Wykonane z wiskozy, pachnące Miks kolorów Wymiary: 37 x 38 cm","op (5 szt)"]
[24,"Proszek do prania tkanin kolorowych DOSIA, 300 g","Proszek do prania tkanin kolorowych do wszystkich typów pralek i do prania ręcznego\nZawiera enzymy i aktywne składniki piorące\nNie zawiera chlorowych wybielaczy: jest delikatna dla kolorowych i ciemnych tkanin\nJednostka sprzedaży: 1 sztuka (300 g)","op (300g)"]
[25,"Proszek do prania tkanin PUROX, 5 kg","Do wszystkich typów pralek i do prania ręcznego, Jednostka sprzedaży: 1 opakowanie (5 kg), Składniki: do 5% anionowe i niejonowe środki powierzchniowo czynne, enzymy, kompozycja zapachowa, krzemiany, niejonowe środki powierzchniowo, czynne, regulatory piany, rozjaśniacze optyczne, związki wybielające na bazie tlenu","op (5 kg)"]
[26,"Chusteczki FELLOWES do czyszczenia ekranów, opakowanie 100szt","Chusteczki FELLOWES do czyszczenia ekranów, opakowanie 100szt","op (100 szt)"]
[27,"Płyn AJAX Floral Fiesta, 1 l","Doskonale usuwa kurz i brud, pozostawiając na długo świeży zapach Miks zapachów Pojemność: 1 l Jednostka sprzedaży 1 sztuka","op (1l)"]
[28,"Preparat do usuwania tłustego brudu VOIGT C457 Ultra Clean plus 1 l","Odtłuszczanie, gruntowne mycie bez fosforanów – Produkt do profesjonalnego zastosowania, Nie zawierający fosforanów, Usuwa zabrudzenia pochodzenia tłuszczowego i przemysłowego m.in. oleje, smary. Zalecany do: warsztatów, hal produkcyjnych, galerii handlowych, centrów logistycznych","op (1l)"]
[29,"Rozpuszczalnik do etykiet w sprayu, pojemność 200 ml","Produkt zapewnia w pełni bezpieczne usunięcie etykiet z dowolnej powierzchni, nie pozostawiając żadnych, śladów kleju. Pojemność 200 ml.","op (200 ml)"]
[30,"Gąbka do zmywania różowa, 5 sztuk","Gąbka do różnorodnych zastosowań, Kolor: różowy","op (5 szt)"]
[31,"Gąbki do zmywania standardowa, 5 sztuk","Do zmywania naczyń, szkła, ceramiki, powierzchni emaliowanych Wytrzymała Miks kolorów w opakowaniu Jednostka sprzedaży: 1 opakowanie (5 sztuk) Opakowanie zbiorcze: 18 opakowań","op (5 szt)"]
[32,"Kuchenka mikrofalowa SEVERIN 7890/7862, biała","5 poziomów mocy, Rozmrażanie w oparciu o czas i wagę, 35-minutowy timer z sygnałem akustycznym, Pokrętło regulacyjne z chromowanymi elementami, Średnica wyjmowanego talerza ok. 25,4 cm, Wysokość komory ok. 16,5 cm, Obudowa i komora lakierowana powłoką odporną na wysokie temperatur, Wymiary: szer. 43,5, gł. 34,5, wys. 25,4 cm, Moc: 700 W","szt"]
[33,"Jednorazowa maska higieniczna 3-warstwowa, niebieska, 50 sztuk","Trójwarstwowa maska higieniczna. Wykonana z włókniny polipropylenowej (100%). Materiał: Texfil 25 (Spunbond) + Texfil 25 (Spunbond) + Texfil 25 (Spunbond). Gramatura: 25 gsm + 25 gsm + 25 gsm= 75 gsm. Gumki – długość 16cm - 18cm (± 1cm).","op (50szt)"]
[34,"Półmaska FILTERSERVICE FS-623V NR D, FFP2, z zaworem, 10 sztuk","Czasza półmaski: - Igłowana włóknina poliestrowa,  - Włóknina polipropylenowa typu melt blown, - Włóknina osłonowa, - Zawór wydechowy, - Zapinki taśm nagłowia, - Taśma nagłowia","op (10szt)"]
[35,"Nawilżacz powietrza NU 5N","4 poziomy intensywności nawilżania, Automatyczna kontrola wilgotności, Demontowany zasobnik wody 5,2 l, Funkcja jonizacji","szt"]
[36,"Odświeżacz powietrza AMBI PUR, zapach kwiatowy, 300 ml","Wypełnia pomieszczenie zapachem najpiękniejszego wiosennego bukietu Pojemność: 300 ml Jednostka sprzedaży: 1 sztuka Opakowanie zbiorcze: 6 sztuk","szt"]
[37,"Odświeżacz powietrza BRISE w sprayu","Odświeżając pomieszczenia pozostawia przyjemny zapach Pojemność: 300 ml Jednostka sprzedaży: 1 sztuka ","szt."]
[38,"Odświeżacz powietrza BRISE w żelu, miks zapachów","Masa netto: 150 g Miks zapachów Jednostka sprzedaży: 1 sztuka ","szt."]
[39,"Odświeżacz powietrza GREEN FRESH, 400 ml","Skutecznie neutralizuje i pochłania nieprzyjemne zapachy\nOdświeża i nawilża powietrze, pozostawiając w pomieszczeniu uczucie świeżości i czystości Pojemność: 400 ml Jednostka sprzedaży: 1 sztuka","op. (400 ml)"]
[40,"Patyczki zapachowe PACHNĄCA SZAFA, Słoneczne popołudnie, 50 ml","Patyczki zapachowe PACHNĄCA SZAFA nadają przyjemny i odświeżający zapach w każdym pomieszczeniu. Odświeżać ma bardzo ładną formę eleganckich patyczków w szklanym flakoniku.","op (50 ml)"]
[41,"Wkład do odświeżacza AMBI PUR, zapach ocean and wind","Wkład do elektrycznego odświeżacza powietrza AMBI PUR (6.630.347) Wydajność wkładów: do 80 dni Jednostka sprzedaży: 1 sztuka ","szt"]
[42,"Papier toaletowy CLASSIC, biały, 8 rolek","Papier toaletowy CLASSIC, biały, 8 rolek Wymiary listka: szer. 100 x dł. 112 mm, Szerokość taśmy: 100 mm","op. (8 rolek)"]
[43,"Papier toaletowy ELLIS PROFESSIONAL JUMBO 130/2, 12 rolek","Papier do użytku profesjonalnego w pomieszczeniach o zwiększonym natężeniu użytkowania, Materiał: celuloza dwuwarstwowa, Gramatura: 2 x 16 g/m², Długość roli: 120 m; średnica roli: 19 cm; średnica gilzy: 6 cm","op (12 rolek)"]
[44,"Papier toaletowy KATRIN 11296 PLUS 160, biały, 8 rolek","Papier toaletowy KATRIN 11296 PLUS 160, biały, 8 rolek Gramatura: 2 x 16,5 g/m², Długość jednej rolki: 18,3 m","op. (8 rolek)"]
[45,"Supermocny Plaster do cięcia VISCOPLAST, 1 m x 8 cm","Opatrunek włókninowy o wysokiej chłonności, Plaster natychmiast przykleja się do skóry, nawet do wilgotnej, Ogranicza przywieranie opatrunku do rany","op (1m)"]
[46,"Uniwersalny zestaw plastrów 3M VISCOPLAST, 24 sztuki","Plastry z opatrunkiem do opatrywania drobnych ran i skaleczeń Hypoalergiczne i wodoodporne Przepuszczające powietrze W opakowaniu 24 plastry: plastry Minifol: 72 x 25 mm - 4 sztuki, 72 x 19 mm - 8 sztuk, 57 x 16 mm - 6 sztuk, 38x10 mm - 4 sztuki Plaster Prestopor 10 x 6 cm Plaster Prestovis Plus 10 x 6 cm Jednostka sprzedaży: 1 opakowanie","op. ( 24 szt)"]
[47,"Krem do rąk EVELINE ''Niewidzialne rękawiczki'', 100 ml","Odżywczo-ochronny krem do rąk z formułą witaminową Polecany do suchych i podrażnionych dłoni Pojemność: 100 ml Jednostka sprzedaży: 1 sztuka ","op do (100 ml)"]
[48,"Krem do rąk GARNIER do skóry bardzo suchej, 100 g","Regeneruje i odżywia zniszczoną skórę dłoni Zawiera alantoinę, glicerynę oraz czynnik filtrującyJednostka sprzedaży: 1 sztuka (100 g)","op. (100 g)"]
[49,"Ręcznik MALFINI, chabrowy, 70x140 cm","Tkana metka, która może również służyć jako wieszaczek, Ozdobiony wyszywaną bordiurą po obu brzegach, Sklad: 100% bawełna, frotte, Gramatura: 450g/m², Kolor: chabrowy, Rozmiar: 70x140 cm","szt"]
[50,"Ręcznik MALFINI, granatowy, 50x100 cm","Tkana metka, która może również służyć jako wieszaczek, Ozdobiony wyszywaną bordiurą po obu brzegach, Sklad: 100% bawełna, frotte, Gramatura: 450g/m², Kolor: granatowy","szt"]
[51,"Ręcznik MALFINI, szaro-czarny, 50x100 cm","Wykonane z wysokiej jakości frotte, odpowiednie pod haft, Miękkie, miłe w dotyku, dobrze absorbują wodę, Tkana metka, która może również służyć jako wieszaczek, Ozdobiony wyszywaną bordiurą po obu brzegach, Sklad: 100% bawełna, frotte, Gramatura: 450g/m² kolor szaroczany ","szt"]
[52,"Ręcznik MALFINI, szaro-czarny, 70x140 cm","Tkana metka, która może również służyć jako wieszaczek, Ozdobiony wyszywaną bordiurą po obu brzegach, Sklad: 100% bawełna, frotte, Gramatura: 450g/m², Kolor: szaroczarny Rozmiar: 70x140 cm","szt"]
[53,"Chusteczki higieniczne VELVET, 120 sztuk","Chusteczki higieniczne VELVET, 120 sztuk. W opakowaniu 120 sztuk, Produkt ma atest PZH, ","op (120 szt)"]
[54,"Ręcznik w roli ESTIMO 100/2, 500 listków","Wytrzymały, dwuwarstwowy ręcznik w 100% wykonany z celulozy o wysokich parametrach i pięknym designie Długość rolki: 100 m W rolce 500 odcinków o wymiarach: 20,3 x 20 cm Kolor biały Jednostka sprzedaży: 1 rolka ","op. (rolka 100 m)"]
[55,"Ręczniki papierowe białe, składka V, 20 x 200 listków","Gofrowane ręczniki w składce Kompatybilne ze standardowymi dozownikami do ręczników typu ZZ Materiał: makulatura jednowarstwowa Wymiary listka: 25 x 23 cm Gramatura: 1 x 30 g/m² Ilość bind w opakowaniu: 20 Ilość listków w bindzie: 200 Kolor: biały Jednostka sprzedaży: 1 karton (4000 listków)","op. (20 x 200 listków)"]
[56,"Ręczniki papierowe MERIDA składka V, 20 x 160 listków","Gofrowane ręczniki w składce wysokiej chłonności Kompatybilne ze standardowymi dozownikami do ręczników typu ZZ Materiał: makulatura dwuwarstwowa Wymiary listka: 25 x 23 cm Gramatura:2 x 19 g/m² Tłoczenie: nie Ilość bind w opakowaniu: 20 Ilość listków w bindzie: 160 Kolor: biały Jednostka sprzedaży: 1 karton (3200 listków)","op. (20 x 160 listków)"]
[57,"Ręczniki papierowe zielone, składka V, 20 x 200 listków","Gofrowane ręczniki w składce wysokiej chłonności Kompatybilne ze standardowymi dozownikami do ręczników typu ZZ Materiał: makulatura dwuwarstwowa Wymiary listka: 25 x 23 cm Gramatura:2 x 19 g/m² Tłoczenie: nie Ilość bind w opakowaniu: 20 Ilość listków w bindzie: 160 Kolor: zielon. Jednostka sprzedaży: 1 karton (3200 listków)","op. (20 x 200 listków)"]
[58,"Ręczniki w roli TORK UNIVERSAL Extra Długie do systemu TORK Matic H1, 6 rolek","Materiał: makulatura jednowarstwowa, Tłoczenie: nie, Ilość listków:1120, Długość roli: 280 m; wysokość roli: 21 cm; średnica roli: 19 cm; średnica gilzy: 3,8 cm","op. (1120 listków)"]
[59,"Rękawice antystatyczne ANSELL HyFlex® 11-800, rozmiar 9, para","Nylonowe rękawice z powłoką z pianki nitrylowej, wykonane w technologii KnitZonz™ Wszechstronne rozwiązanie do precyzyjnego montażu i prac ogólnych Zaawansowana technologia dziania zapewnia większą rozciągliwość i elastyczność w miejscach o zwiększonym nacisku Antystatyczne, zgodne z normą EN 1149 Norma EN 388 3131 (EN 388:2016 3131A) Rozmiar: 9 Jednostka sprzedaży: 1 para ","op. (1 para)"]
[60,"Rękawice DELTAPLUS VV835 Chemsafe, rozmiar 11, para","Rękawica z podwójną powłoką nitrylową na wkładzie z poliamidu, Trzecia powłoka z szorstkiej pianki nitrylowej na stronie chwytnej i końcach palców, Długość: 35 cm, Grubość: 1,15 mm - 1,30 mm na stronie chwytnej","op, 1 (para)"]
[61,"Rękawice nitrylowe MEDASEPT PF, czarne, rozmiar S, 100 sztuk","Uniwersalne, rękawice pasujące na prawą i lewą dłoń, Nitrylowe, Tekstura na końcach palców, Rozmiar S","op. (100 szt)"]
[62,"Rękawice nitrylowe MEDASEPT PREMIER, niebieskie, rozmiar XL, 100 sztuk","Rękawice nitrylowe diagnostyczne i ochronne (kat. III), Bezpudrowe., Uniwersalny kształt pasuje na obie dłonie, Tekstura na końcach palców, Przeznaczone do kontaktu z żywnością.","op. (100 szt)"]
[63,"Rękawice nitrylowe MEDASEPT PRIME, niebieskie, rozmiar L, 100 sztuk","Rękawice nitrylowe diagnostyczne i ochronne, Bezpudrowe. Uniwersalny kształt pasuje na obie dłonie. ","op. (100 szt)"]
[64,"Rękawice nitrylowe MEDASEPT PRIME, niebieskie, rozmiar M, 100 sztuk","Rękawice nitrylowe diagnostyczne i ochronne","op. (100 szt)"]
[65,"Ręcznik kuchenny VELVET Jumbo, 1 rolka","Dwuwarstwowy ręcznik papierowy, który świetnie nadaje się do generalnych porządków, prac w garażu, ogrodzie oraz w kuchni Giga rola = 13 standardowych rolek Nie tylko chłonny i wytrzymały, ale także wyjątkowo wydajny Jedna rolka zawiera aż 520 listków Wysokość rolki: 22 cm Kolor biały Jednostka sprzedaży: 1 rolka ","szt ( 1 rolka)"]
[66,"Ręcznik papierowy BRATEK biały, 2 rolki","Ręczniki kuchenne, dwuwarstwowe, celulozowe Szerokość rolki: 22 cm Długość rolki: 11 m Jednostka sprzedaży: 1 opakowanie (2 sztuki)","op (2 rolki)"]
[67,"Ręczniki kuchenne AHA, 2 rolki","Dwuwarstwowy ręcznik wykonany z czystej celulozy W rolce 50 odcinków o wymiarach: 23 x 20 cm W opakowaniu: 2 rolki Kolor biały Jednostka sprzedaży: 1 opakowanie ","op (2 rolki)"]
[68,"Ręczniki kuchenne VELVET, 2 rolki","Produkt wolny od bisfenolu A (BPA FREE), posiada atest NIZP-PZH","op. (2 rolki)"]
[69,"Łyżeczki do herbaty AMEFA Bologna, 12 sztuk","subtelne i eleganckie łyżeczki do herbaty, Sztućce polerowane, stal 18/0","op (12 szt)"]
[70,"Łyżeczki do kawy AMEFA Bologna, 12 sztuk","Klasyczne, proste w formie, subtelne i eleganckie łyżeczki do kawy Dobra jakość w atrakcyjnej cenie powodują, iż linia od lat cieszy się wyjątkową popularnością  Sztućce polerowane, stal 18/0","op (12 szt)"]
[71,"Łyżki AMEFA Bologna, 12 sztuk","Sztućce polerowane, stal 18/0","op (12 szt)"]
[72,"Widelce AMEFA Bologna, 12 sztuk","\nSztućce polerowane, stal 18/0, ","op (12 szt)"]
[73,"Ściereczki mokre do mebli drewnianych PRESTO, opakowanie 72 sztuki","Ściereczki nawilżane do czyszczenia różnych powierzchni, Usuwają kurz i zapobiegają jego osadzaniu, Nadają połysk czyszczonym powierzchniom","op. (72 szt)"]
[74,"Kulki do toalet BREF Power Activ, 50 g, zapach cytrynowy","Nowoczesne rozwiązanie w postaci czterech kulek na wygodnej zawieszce Czyszczą, pozostawiają przyjemny zapach i chronią przed osadzaniem się kamienia Masa netto: 50 g Jednostka sprzedaży: 1 sztuka Opakowanie zbiorcze: 10 sztuk","op. (50 g)"]
[75,"Kulki do toalet BREF Power Activ, 50 g, zapach morski","Nowoczesne rozwiązanie w postaci czterech kulek na wygodnej zawieszce Czyszczą, pozostawiają przyjemny zapach i chronią przed osadzaniem się kamienia Masa netto: 50 g Jednostka sprzedaży: 1 sztuka ","op. (50 g)"]
[76,"Płyn CILIT Bang Kamień i brud, 750 ml","Żel CILIT kamień i brud z Turbo Power. Do czyszczenia wanien, kabin prysznicowych, płytek, toalet, armatury kuchennej i łazienkowej Usuwa kamień, rdzawe zacieki z twardej wody, osad z mydła i inne zabrudzenia Pojemność: 750 ml Jednostka sprzedaży: 1 sztuka","op. (750 ml)"]
[77,"Płyn do toalet DOMESTOS Toilet Limescale Remover, 750 ml","Gęsty płyn do czyszczenia muszli klozetowych Formuła ściśle przylegająca do czyszczonych powierzchni, rozpuszcza kamień wapienny Przeznaczony do powierzchni porcelanowych i szkliwionych Butelka z wygodnym dozownikiem Pojemność: 750 ml Jednostka sprzedaży: 1 sztuka Opakowanie zbiorcze: 6 sztuk","op. (750 ml)"]
[78,"Płyn do WC DOMESTOS 24H, 1,25 l, cytrynowy","Produkt czyszcząco-dezynfekująco-wybielający Możliwość stosowania do: muszli klozetowych, umywalek, zlewów itp. Produkt nadaje się także do wybielania tkanin Jednostka sprzedaży: 1 sztuka Pojemność: 1,25 l ","op. (1,25 l)"]
[79,"Płyn do WC DOMESTOS 24H, 1,25 l, leśny","Produkt czyszcząco-dezynfekująco-wybielający Możliwość stosowania do: muszli klozetowych, umywalek, zlewów itp. Produkt nadaje się także do wybielania tkanin Pojemność: 1,25 l Jednostka sprzedaży: 1 sztuka ","op. (1,25 l)"]
[80,"Wkład zapachowy do pisuarów MERIDA, czerwony","Winylowy, elastyczny wkład zapachowy do pisuarów, Zapach utrzymuje się przez około 30 dni, Dodatkowo wkład zabezpiecza pisuar przed zapchaniem","szt."]
[81,"Zawieszka do WC DOMESTOS, zapach leśny","Zawieszki czyszczące do toalet Chronią przed osadzaniem się kamienia i pozostawiają świeży zapach Jednostka sprzedaży 1 sztuka ","szt"]
[82,"Żel BREF do WC Fresh Mist, 700 ml","Usuwa kamień, brud i osad, Gęsta formuła żelu sprawia, że działa on również pod powierzchnią wody.","op. (700 ml)"]
[83,"Żel CLINEX Drill do udrażniania odpływów, 1 l","Szybko rozpuszcza wszelkie stałe i organiczne zanieczyszczenia takie jak: tłuszcz, papier, wata, odpadki kuchenne, Forma żelowa pozwala na osadzanie się preparatu na ściankach rur, przedłużając proces działania, Likwiduje nieprzyjemne zapachy, Nadaje się do udrażniania rur zarówno w kuchni, jak i w łazience","op. (1 l)"]
[84,"Biobójczy płyn do dezynfekcji rąk HISKIN, 1 l","Produkt przeznaczony do codziennego stosowania przez użytkownika powszechnego. Wykazuje działanie bakteriobójcze, grzybobójcze i wirusobójcze","op. (1 l)"]
[85,"Dozownik do mydła w płynie MERIDA TOP, biały","Mocny i trwały dozownik do mydła w płynie wykonany z tworzywa ABS Okienko umożliwiające kontrolę zużycia mydła Pojemność: 0,8 l Zestaw do montażu w komplecie Wymiary: dł. 11,5 x szer.11,5 x wys. 25 cm Kolor: biały Jednostka sprzedaży: 1 sztuka","szt."]
[86,"Mydło toaletowe NIVEA, 100 g","Kremowe mydło z odżywczym olejkiem migdałowym Miks zapachów Jednostka sprzedaży: 1 sztuka ","szt. (100 g)"]
[87,"Mydło w płynie MERIDA Silva, 5 l","Mydło w płynie typu „dwa w jednym”, Zawiera m.in. glukopony mające doskonałe właściwości pielęgnacyjne skóry, jak również gluadyny – roślinne proteiny, szczególnie cenne składniki pielęgnacyjne chroniące skórę i włosy","op. (5l)"]
[88,"Mydło w płynie PALMOLIVE, migdałowe, 300 ml","Dzięki naturalnemu pH nie podrażnia nawet wrażliwej skóry Zawiera kombinację substancji czyszczących i odżywczych Opakowanie z dozownikiem Pojemność 300 ml Jednostka sprzedaży: 1 sztuka Opakowanie zbiorcze: 12 sztuk","op. (300 ml)"]
[89,"Pasta BHP do rąk, ścierna, 500 g","Usuwa silne zabrudzenia smarami, tłuszczami, sadzami","op. (500g)"]
[90,"Pasta do rąk MERIDA PA12, 500 ml","Usuwa wszelkie zabrudzenia nawet powstałe od smarów i olejów, Oszczędna w użyciu, Jest niealkaliczna i nie zawiera mineralnych środków ściernych","op. (500 ml)"]
[91,"Kapsułki do zmywarek FAIRY Jar All in 1, 115 kapsułek","Wydajne kapsułki do maszynowego mycia naczyń Jednostka sprzedaży: 1 opakowanie (115 kapsułek) ","op. ( 115 szt)"]
[92,"Płyn do czyszczenia zmywarek FINISH, 250 ml","Płyn do czyszczenia zmywarek o zapachu cytrynowym Pojemność: 250 ml Jednostka sprzedaży 1 opakowanie","op (250 ml)"]
[93,"Płyn do mycia naczyń LUDWIK 1150 g","Posiada bardzo dobre właściwości myjące oraz wysoką zdolność do emulgowania tłuszczów zarówno w ciepłej, jak i zimnej wodzie. Nie pozostawia zacieków na umytych powierzchniach, nadaje im połysk bez konieczności wycierania do sucha. Nowa receptura została również wzbogacona kompleksem witamin A,E,F,H, mającym działanie ochronne i odżywcze dla skóry rąk, Polecany również do mycia mebli, lodówek, wykładzin, podłóg, glazury, dywanów i tworzyw sztucznych","op. (1150 g)"]
[94,"Płyn do mycia naczyń LUDWIK cytrynowy, 5 kg","Posiada bardzo dobre właściwości myjące oraz wysoką zdolność do emulgowania tłuszczów zarówno w ciepłej, jak i zimnej wodzie. Nie pozostawia zacieków na umytych powierzchniach, nadaje im połysk bez konieczności wycierania do sucha. Nowa receptura została również wzbogacona kompleksem witamin A,E,F,H, mającym działanie ochronne i odżywcze dla skóry rąk, Polecany również do mycia mebli, lodówek, wykładzin, podłóg, glazury, dywanów i tworzyw sztucznych","5 kg"]
[95,"Płyn do mycia naczyń LUDWIK Miętowy 1 l.","Posiada bardzo dobre właściwości myjące oraz wysoką zdolność do emulgowania tłuszczów zarówno w ciepłej, jak i zimnej wodzie. Nie pozostawia zacieków na umytych powierzchniach, nadaje im połysk bez konieczności wycierania do sucha. Nowa receptura została również wzbogacona kompleksem witamin A,E,F,H, mającym działanie ochronne i odżywcze dla skóry rąk, Polecany również do mycia mebli, lodówek, wykładzin, podłóg, glazury, dywanów i tworzyw sztucznych","op. (1 l)"]
[96,"Płyn do mycia naczyń LUDWIK, cytrynowy, 450 g","Posiada bardzo dobre właściwości myjące oraz wysoką zdolność do emulgowania tłuszczów zarówno w ciepłej, jak i zimnej wodzie. Nie pozostawia zacieków na umytych powierzchniach, nadaje im połysk bez konieczności wycierania do sucha. Nowa receptura została również wzbogacona kompleksem witamin A,E,F,H, mającym działanie ochronne i odżywcze dla skóry rąk, Polecany również do mycia mebli, lodówek, wykładzin, podłóg, glazury, dywanów i tworzyw sztucznych","op. (450g)"]
[97,"Płyn do naczyń LUDWIK, 450 g, miętowy"," Nie pozostawia zacieków na umytych powierzchniach, nadaje im połysk bez konieczności wycierania do sucha. Polecany również do mycia mebli, lodówek, wykładzin, podłóg, glazury, dywanów i tworzyw sztucznych.","op.(450g)"]
[98,"Płyn nabłyszczający do zmywarek LUDWIK, 750 ml","Przeznaczony do płukania i nabłyszczania naczyń zmywanych w zmywarce Dzięki właściwie dobranym składnikom i zawartości kwasku cytrynowego płyn sprawia, że myte naczynia wysychają bez plam i zacieków Jednostka sprzedaży: 1 opakowanie (750 ml)","op. (750 ml)"]
[99,"Płyn nabłyszczający FINISH, 400 ml","Usuwa ślady po kroplach wody i osad z kamienia, pozostawiając Diamentowy Połysk Jednostka sprzedaży: 1 opakowanie (400 ml)","op. (400 ml)"]
[100,"Sól ochronna do zmywarki LUDWIK, 1,5 kg","Preparat chroniący zmywarkę przed osadzaniem się kamienia w jej wnętrzu i na mytych naczyniach Skutecznie zmiękcza wodę dzięki zastosowanej formule, preparat zawiera całkowicie rozpuszczalną szlachetną sól z granulkami o odpowiedniej wielkości Regularne stosowanie soli ochronnej Ludwik zapewnia prawidłowe funkcjonowanie zmywarki i długotrwałą ochronę jej mechanizmów Jednostka sprzedaży: 1 opakowanie (1,5 kg)","op. (1 l)"]
[101,"Sól SOMAT do zmywarek, 1,5 kg","Zabezpiecza zmywarkę oraz naczynia przed osadzaniem się kamienia Wygodna w użyciu sól ma postać granulek Opakowanie: 1,5 kg Jednostka sprzedaży: 1 sztuka ","op. (5 kg)"]
[102,"Tabletki do zmywarek LUDWIK, 30 sztuk","Wielofunkcyjne tabletki czyszczą, nabłyszczają, chronią szkło i stal nierdzewną przed matowieniem oraz zabezpieczają zmywarkę przed osadzaniem się kamienia Funkcja zmiękczania wody pozwala na jeszcze bardziej efektywne wykorzystanie składników myjących Enzymy są aktywne już w 30°C Cytrusowy aromat tabletek nadaje długotrwały zapach świeżości w kuchni Zapewniają oszczędność wody i energii Jednostka sprzedaży: 1 opakowanie (20 g x 30 tabletek)","op. (30 szt)"]
[103,"Płyn do mycia szyb i glazury LUDWIK grapefruit z octem, 750 ml","Nie pozostawia smug, zacieków i szybko odparowuje., Skład: do 5% anionowe środki powierzchniowo czynne, konserwant (2-bromo-2-nitropropane-1,3-diol, methylchloroisothiazolinone, methylisothiazolinone), kompozycja zapachowa (limonene, linalool).","op. (750ml)"]
[104,"Płyn do mycia szyb KUBUŚ z atomizerem, 1 l","Przeznaczony do mycia szyb okiennych, luster oraz innych powierzchni szklanych, Doskonale usuwa brud, nie pozostawia smug","op. (1 l)"]
[105,"Płyn do szyb i luster BUZIL G522 Profiglass, 600 ml","Gotowy do użycia środek do mycia szyb i luster Skutecznie usuwa zabrudzenia, również te tłuste\nButelka posiada specjalnie przyciętą końcówkę rozpryskującą, która ułatwia nanoszenie środka czyszczącego Wygodna butelka 600 ml ze spryskiwaczem","op (600 ml)"]
[106,"Mleczko do czyszczenia CIF Regular Cream, 650 ml/780 g","Uniwersalne mleczko CIF z mikrokryształkami, które pomaga utrzymać powierzchnie w czystości, jest delikatne i nie rysuje powierzchni. Usuwa najbardziej oporny brud taki jak: przypieczony tłuszcz, przypalone jedzenie, plamy z kamienia w łazience. Składniki: do 5% anionowe środki powierzchniowo, czynne niejonowe środki powierzchniowo czynne, mydło, kompozycja zapachowa Limonene, Benzisothiazolinone, Linalool, Butylphenyl Methylpropional, Hexyl Cinnamal. Sposób użycia: nanieść na wilgotną ściereczkę lub bezpośrednio na czyszczoną powierzchnię. Po wyczyszczeniu dokładnie spłukać. Nie połykać. Mleczko do czyszczenia powierzchni twardych.","op (650 ml)"]
[107,"Czajnik elektryczny TEFAL Express 1,5 l, biały","Czajnik z ukrytym elementem grzejnym i obrotową podstawą, Filtr antywapienny i dwustronny wskaźnik poziomu wody, Możliwość zagotowania minimalnej ilości wody (250 ml), Pojemność: 1,5 l","szt."]
[108,"Dzbanek filtrujący wodę AQUAPHOR Onyx 4,2 l + 3 wkłady filtrujące, biały","Klasyczny i elegancki kształt pasuje do biur i sal konferencyjnych, Produkt wolny od bisfenolu A (BPA FREE), posiada atest NIZP-PZH, W zestawie 3 wkłady Maxfor MG wzbogacające wodę w magnez","op. (3 szt.)"]
[109,"Filtr wody KRUPS F08801 do ekspresu ciśnieniowego, 1 sztuka","Zapobiega nadmiernemu osadzaniu się kamienia Dostosowany do ekspresów Krups Artese oraz Krups Orchestro Jednostka sprzedaży: 1 sztuka","szt"]
[110,"Termos TEFAL Campo, 1 l, czarny","Termos TEFAL Campo, 1 l, czarnyObudowa ze stali nierdzewnej z kolorową powłoką z wkładką szklaną, Kolor: czarny","szt"]
[111,"Reklamówki foliowe 9 micronów 210 + 2 x 60 x 435 mm (+/-12), 150 sztuk","Reklamówki o wymiarach 210 + 2 x 60 x 435 mm (+/-12) Nawój: 150 sztuk\nFolia HDPE / grubość 9 mikronówJednostka sprzedaży: 1 rolka (150sztuk)\n","op. (150 szt.)"]
[112,"Worki do segregacji 60 l, niebieskie na szkło, 60 x 72 cm","Wytrzymałe worki ułatwiające segregację śmieci dzięki kodowi kolorystycznemu, Mają nadruk informujący, jakie typy odpadów należy do nich wrzucać, a jakich nie należy, Wymiary: 60 x 72 cm","op. "]
[113,"Worki do segregacji 60 l, zielone na szkło, 60 x 72 cm","Wytrzymałe worki ułatwiające segregację śmieci dzięki kodowi kolorystycznemu, Mają nadruk informujący, jakie typy odpadów należy do nich wrzucać, a jakich nie należy, Wymiary: 60 x 72 cm","op"]
[114,"Worki do segregacji 60 l, zółte na szkło, 60 x 72 cm","Wytrzymałe worki ułatwiające segregację śmieci dzięki kodowi kolorystycznemu, Mają nadruk informujący, jakie typy odpadów należy do nich wrzucać, a jakich nie należy, Wymiary: 60 x 72 cm","op"]
[115,"Worki na śmieci LDPE sanitarne 120 l, niebieskie, 10 sztuk","Wymiary: 110 x 70 cm, Grubość: folii: 0,03 mm","op (10 szt)"]
[116,"Worki na śmieci LDPE sanitarne 160 l, czarne, 20 sztuk","Worki na śmieci LDPE sanitarne 160 l, czarne, 20 sztuk Pojemność: 160 l Wymiary: 150 x 90 cm Grubość: folii: 0,027 mm Kolor folii: czarny Jednostka sprzedaży: 1 opakowanie (20 sztuk)","op. (20 sztuk)"]
[117,"Worki na śmieci LDPE z taśmą ściągającą 60 l, czarne, 10 sztuk","Posiadają taśmę ściągającą Pojemność: 60 l Wymiary: 72 x 60 cm Grubość: folii: 0,02 mm Kolor folii: czarny Jednostka sprzedaży: 1 opakowanie (10 sztuk)","op. (10 sztuk)"]
[118,"Worki na śmieci MDPE 35 l, niebieskie 20 sztuk","Pojemność: 35 l Wymiary: 58 x 49 cm Grubość: folii: 0,011 mm Kolor folii: niebieski Jednostka sprzedaży: 1 opakowanie (20 sztuk)","op. (20 sztuk)"]

{"sheet":"Załącznik14-F.O. dla Zadania 11","index":5,"n_rows":149,"n_cols":22,"rows_kept":149,"cut":false,"hidden":false,"merged":[[2,1,2,7],[4,1,4,7],[8,1,8,7],[11,1,11,7],[14,1,14,7],[18,1,18,2],[147,2,147,3],[147,4,147,7],[148,5,148,7],[16,1,16,7]]}
[null,"Oznaczenie sprawy:  1400/DW00/ZU/KZ/2022/0000079539"]
[]
[null,"ZAŁĄCZNIK NR 14 - FORMULARZ OFERTY DLA ZADANIA 11 - DOSTAWA ARTYKUŁÓW HIGIENICZNYCH:  POZNAŃ+ WOJ. WIELKOPOLSKIE;  BYDGOSZCZ+ WOJ. KUJAWSKO-POMORSKIE; CHOJNICE + WOJ. POMORSKIE"]
[]
[]
[null,null,"(pieczęć wykonawcy)"]
[]
[null,"Ja, niżej podpisany (My niżej podpisani):"]
[]
[]
[null,"działając w imieniu i na rzecz:"]
[]
[]
[null,"Składam(y) ofertę na wykonanie zamówienia, którego przedmiotem jest:"]
[null,"Dostawa artykułów biurowych, spożywczych i higienicznych dla spółek GK ENEA"]
[]
[null,"ZADANIE 11 - Dostawa artykułów higienicznych:  Poznań+ woj. Wielkopolskie;  Bydgoszcz+ woj. Kujawsko-Pomorskie; Chojnice + woj. Pomorskie"]
[]
[null,"ŁĄCZNA CENA NETTO OFERTY DLA ZADANIA 11:",null,{"$f":"SUM(H22:H143)","v":0}]
[]
[null,"LP","Nazwa produktu","Opis szczegółowy","Jednostka ","cena jednostkowa netto","Ilość","Wartość","ENEA Centrum Sp. z o.o. - Szacowana ilość","ŁĄCZNA CENA NETTO DLA ENEA Centrum Sp. z o.o. ","Enea Logistyka sp.z o.o. - Szacowana ilość","ŁĄCZNA CENA NETTO DLA ENEA Logistyka sp. z o.o.","ENEA Operator Sp. z o.o. - Szacowana ilość","ŁĄCZNA CENA NETTO DLA ENEA Operator Sp. z o.o. ","ENEA Oświetlenie Sp. z o.o. - Szacowana ilość","ŁĄCZNA CENA NETTO DLA ENEA Oświetlenie Sp. z o.o. ","ENEA Pomiary Sp. z o.o. - Szacowana ilość","ŁĄCZNA CENA NETTO DLA ENEA Pomiary Sp. z o.o. ","ENEA Serwis Sp. z o.o. - Szacowana ilość","ŁĄCZNA CENA NETTO DLA ENEA Serwis Sp. z o.o. ","ENEA S.A. - Szacowana ilość","ŁĄCZNA CENA NETTO DLA ENEA S.A. "]
[null,1,"Filtr do expresu DELONGHI 45.76X","Filtr do expresu DELONGHI 45.76X","szt",{"$f":"IF('Załącznik 13-F.O. Zad 11-15 '!$V$55,VLOOKUP(C22,'Załącznik 13-F.O. Zad 11-15 '!$C$52:$G$174,5,0),0)","v":0},{"$f":"I22+K22+M22+O22+Q22+S22+U22","v":1},{"$f":"G22*F22","v":0},null,{"$f":"I22*F22","v":0},0,{"$f":"K22*F22","v":0},0,{"$f":"M22*F22","v":0},null,{"$f":"O22*F22","v":0},null,{"$f":"Q22*F22","v":0},1,{"$f":"S22*F22","v":0},null,{"$f":"U22*F22","v":0}]
[null,2,"ODKAMIENIACZ DO EKSPRESU MELITTA 250ML","odkamieniacz do  ekspresu MELITA poj. 250 ml.","szt. (250 ml)",{"$f":"IF('Załącznik 13-F.O. Zad 11-15 '!$V$55,VLOOKUP(C23,'Załącznik 13-F.O. Zad 11-15 '!$C$52:$G$174,5,0),0)","v":0},{"$f":"I23+K23+M23+O23+Q23+S23+U23","v":20},{"$f":"G23*F23","v":0},6,{"$f":"I23*F23","v":0},0,{"$f":"K23*F23","v":0},13,{"$f":"M23*F23","v":0},null,{"$f":"O23*F23","v":0},null,{"$f":"Q23*F23","v":0},1,{"$f":"S23*F23","v":0},null,{"$f":"U23*F23","v":0}]
[null,3,"Odkamieniacz KAMIX, w proszku, 150 g","Środek do usuwania osadów z kamienia Pojemność: 150 g Jednostka sprzedaży: 1 opakowanie ","op. ( 150 g)",{"$f":"IF('Załącznik 13-F.O. Zad 11-15 '!$V$55,VLOOKUP(C24,'Załącznik 13-F.O. Zad 11-15 '!$C$52:$G$174,5,0),0)","v":0},47,0,1,0,{"$f":"10*1.8","v":18},0,21,0,5,0,1,0,1,0,null,0]
[null,4,"Odkamieniacz uniwersalny KAMIX, w płynie, 500 ml","Środek w płynie do usuwania osadów kamienia Pojemność: 500 ml Jednostka sprzedaży: 1 opakowanie ","op. (500 ml)",{"$f":"IF('Załącznik 13-F.O. Zad 11-15 '!$V$55,VLOOKUP(C25,'Załącznik 13-F.O. Zad 11-15 '!$C$52:$G$174,5,0),0)","v":0},89,0,8,0,36,0,40,0,3,0,1,0,1,0,null,0]
[null,5,"Tabletki do czyszczenia sekcji mlecznej ekspresu","Tabletki do codziennego czyszczenia sekcji mlecznej zapewniają dokładne i higieniczne użytkowanie sekcji mlecznej Jednostka sprzedaży: 1 opakowanie","op. ( 62 szt )",{"$f":"IF('Załącznik 13-F.O. Zad 11-15 '!$V$55,VLOOKUP(C26,'Załącznik 13-F.O. Zad 11-15 '!$C$52:$G$174,5,0),0)","v":0},1,0,null,0,0,0,0,0,null,0,null,0,1,0,null,0]
[null,6,"Płyn odkamieniający DELONGHI \"EcoDecalk\"","odkamieniacz do  ekspresu DELONGHI ","szt.   ",{"$f":"IF('Załącznik 13-F.O. Zad 11-15 '!$V$55,VLOOKUP(C27,'Załącznik 13-F.O. Zad 11-15 '!$C$52:$G$174,5,0),0)","v":0},9,0,null,0,4,0,4,0,null,0,null,0,1,0,null,0]
[null,7,"Tabletki czyszczące KRUPS XS3000, 10 sztuk","Tabletki czyszczące przeznaczone do ekspresów ciśnieniowych i przelewowych Usuwają tłuszcz i pozostałości po kawie wewnątrz ekspresu. Regularne stosowanie gwarantuje utrzymanie wysokiej jakości kawy Jednostka sprzedaży: 1 opakowanie (10 sztuk)","op (10 szt)",{"$f":"IF('Załącznik 13-F.O. Zad 11-15 '!$V$55,VLOOKUP(C28,'Załącznik 13-F.O. Zad 11-15 '!$C$52:$G$174,5,0),0)","v":0},44,0,11,0,4,0,19,0,3,0,6,0,1,0,null,0]
[null,8,"Tabletki do zmywarek FINISH All-in-1, 50 tabletek","Jego unikalna formuła łączy w sobie działanie 10 funkcji Power Actions: usuwanie zaplamień, usuwanie tłuszczu, namaczanie, usuwanie zabrudzeń po herbacie, kryształowy połyski, lśniące sztućce, ochrona przed osadzaniem się kamienia w zmywarce, aktywna ochrona szkła, ochrona srebra, usuwanie opornych zabrudzeń, Dodatkowo spełnia funkcje soli i płynu nabłyszczającego, Składniki: 5 - 15 % związki wybielające na bazie tlenu, niejonowe środki powierzchniowo czynne, do 5 % polikarboksylany, fosfoniany. Enzymy (subtylizyna, amylaza), kompozycja zapachowa.","op (50 szt)",{"$f":"IF('Załącznik 13-F.O. Zad 11-15 '!$V$55,VLOOKUP(C29,'Załącznik 13-F.O. Zad 11-15 '!$C$52:$G$174,5,0),0)","v":0},78,0,5,0,11,0,39,0,15,0,7,0,1,0,null,0]
[null,9,"UNIWERSALNY zestaw do odkamieniania ekspresów","Uniwerslany zestaw do odkamieniania ekspresów Nespresso. Ilość sztuk w opakowaniu: 2 Jednostka sprzedaży: 1 opakowanie","op",{"$f":"IF('Załącznik 13-F.O. Zad 11-15 '!$V$55,VLOOKUP(C30,'Załącznik 13-F.O. Zad 11-15 '!$C$52:$G$174,5,0),0)","v":0},35,0,16,0,8,0,10,0,null,0,null,0,1,0,null,0]
[null,10,"Wkłady filtrujące BRITA Maxtra+ Pure Performance, 3 sztuki","Wybierając wkłady filtrujące Brita Maxtra+ Pure Performance, zapewniasz sobie czystą wodę o doskonałym smaku. Zastosowane perełki węgla aktywnego skutecznie zatrzymują chlor i redukują mogące występować w wodzie zanieczyszczenia, jak herbicydy, pestycydy czy pozostałości po farmaceutykach. Z kolei perełki wymiennika jonowego zmiękczają wodę i zmniejszają występowanie metali w rodzaju miedzi i ołowiu. Wkłady filtrując są rekomendowane do wody miękkiej i średnio twardej.","op (3 szt)",{"$f":"IF('Załącznik 13-F.O. Zad 11-15 '!$V$55,VLOOKUP(C31,'Załącznik 13-F.O. Zad 11-15 '!$C$52:$G$174,5,0),0)","v":0},57,0,null,0,15,0,38,0,3,0,null,0,1,0,null,0]
[null,11,"Worki papierowe do odkurzacza MERIDA Dex, 3 sztuki","Worki papierowe do odkurzacza MERIDA Dex, 3 sztuki","op (3 szt)",{"$f":"IF('Załącznik 13-F.O. Zad 11-15 '!$V$55,VLOOKUP(C32,'Załącznik 13-F.O. Zad 11-15 '!$C$52:$G$174,5,0),0)","v":0},10,0,null,0,9,0,0,0,null,0,null,0,1,0,null,0]
[null,12,"Wymienne wkłady do filtra wody AQUAPHOR MAXFOR","Największa na rynku wydajność - do 200 l, Zawiera innowacyjne włókno Aqualen, dzięki czemu skutecznie usuwa z wody chlor, metale ciężkie, fenol, pestycydy i inne zanieczyszczenia, Redukuje twardość wody i zapobiega pojawianiu się osadu i kamienia na urządzeniach AGD np. w czajnikach i ekspresach, Produkt wolny od bisfenolu A (BPA FREE), wykonany z ekologicznych materiałów","op (3 szt)",{"$f":"IF('Załącznik 13-F.O. Zad 11-15 '!$V$55,VLOOKUP(C33,'Załącznik 13-F.O. Zad 11-15 '!$C$52:$G$174,5,0),0)","v":0},61,0,18,0,0,0,39,0,null,0,3,0,1,0,null,0]
[null,13,"Zestaw do odkamieniania KRUPS F054, 2 saszetki po 40 g","Zestaw polecany do ekspresów KRUPS Informacje na temat sposobu użytkowania dostępne w instrukcji obsługi ekspresu W opakowaniu: 2 saszetki środka odkamieniającego Jednostka sprzedaży: 1 opakowanie (2 saszetki x 40 g)","op (2 saszetki)",{"$f":"IF('Załącznik 13-F.O. Zad 11-15 '!$V$55,VLOOKUP(C34,'Załącznik 13-F.O. Zad 11-15 '!$C$52:$G$174,5,0),0)","v":0},9,0,null,0,6,0,0,0,2,0,null,0,1,0,null,0]
[null,14,"Apteczka VERA TOP 15 PLUS, DIN 13157, w walizce z ABS","Apteczka w walizce z tworzywa ABS. Zawiera stelaż mocujący do ściany W skład wyposażenia wchodzą: kompres zimny – 1 szt., kompres na oko – 2 szt., kompres 10 x 10 cm - 3 opakowania (po 2 sztuki) opaska elastyczna 4 m x 6 cm – 2 szt., opaska elastyczna 4 m x 8 cm – 2 szt., zestaw plastrów 10 x 6 cm (8 szt.) – 1 komplet, zestaw plastrów (14 szt.) – 1 komplet, plaster 5 m x 2,5 cm – 1 szt., opatrunek indywidualny M sterylny – 3 szt. opatrunek indywidualny G sterylny – 1 szt., opatrunek indywidualny K sterylny – 1 szt., chusta opatrunkowa 60 x 80 cm – 1 szt. chusta trójkątna – 1 szt., chusta z flizeliny (5 szt.) – 1 komplet, koc ratunkowy 160 x 210 cm – 1 szt. nożyczki 19 cm – 1 szt., rękawice winylowe – 4 szt. chusteczka dezynfekująca – 6 sztuk, ustnik do sztucznego oddychania – 1 szt., instrukcja udzielania pierwszej pomocy Skład zgodny z normą DIN 13157. Rozmiar: 330 x 235 x 125 mm Jednostka sprzedaży: 1 sztuka","szt",{"$f":"IF('Załącznik 13-F.O. Zad 11-15 '!$V$55,VLOOKUP(C35,'Załącznik 13-F.O. Zad 11-15 '!$C$52:$G$174,5,0),0)","v":0},27,0,7,0,0,0,7,0,null,0,2,0,1,0,10,0]
[null,15,"Wyposażenie apteczki DIN 13157 PLUS","Czajnik posiada filtr antywapienny, który zapobiega przedostawaniu się kamienia do szklanki, Pojemność: 1,7 l Moc: 2400 W","op",{"$f":"IF('Załącznik 13-F.O. Zad 11-15 '!$V$55,VLOOKUP(C36,'Załącznik 13-F.O. Zad 11-15 '!$C$52:$G$174,5,0),0)","v":0},45,0,10,0,0,0,2,0,20,0,2,0,1,0,10,0]
[null,16,"Chusteczki KATRIN Plus, 100 sztuk","Białe, dwuwarstwowe chusteczki higieniczne w praktycznym podajniku Testowane dermatologicznie Jednostka sprzedaży: 1 opakowanie (100 sztuk) ","op (100 szt)",{"$f":"IF('Załącznik 13-F.O. Zad 11-15 '!$V$55,VLOOKUP(C37,'Załącznik 13-F.O. Zad 11-15 '!$C$52:$G$174,5,0),0)","v":0},224,0,152,0,26,0,2,0,10,0,13,0,1,0,20,0]
[null,17,"Czajnik elektryczny TEFAL Express 1,5 l, biały","Filtr antywapienny i dwustronny wskaźnik poziomu wody, Możliwość zagotowania minimalnej ilości wody (250 ml), Pojemność: 1,5 l, Moc: 2400 W","szt",{"$f":"IF('Załącznik 13-F.O. Zad 11-15 '!$V$55,VLOOKUP(C38,'Załącznik 13-F.O. Zad 11-15 '!$C$52:$G$174,5,0),0)","v":0},74,0,24,0,4,0,36,0,3,0,1,0,1,0,5,0]
[null,18,"Czajnik elektryczny TEFAL Loft, 1,7 l, czarny","Zdejmowana pokrywa ułatwia napełnianie wodą, Czajnik posiada filtr antywapienny, który zapobiega przedostawaniu się kamienia do szklanki, Pojemność: 1,7 l, Moc: 2400 W","szt",{"$f":"IF('Załącznik 13-F.O. Zad 11-15 '!$V$55,VLOOKUP(C39,'Załącznik 13-F.O. Zad 11-15 '!$C$52:$G$174,5,0),0)","v":0},81,0,21,0,4,0,43,0,3,0,1,0,1,0,8,0]
[null,19,"Czyściwo włókninowe, wielozadaniowe do trudnych zabrudzeń TORK, 1 rolka","Jednowarstwowe, grube i mocne czyściwo wielozadaniowe non-woven (syntetyczno-celulozowe) Duża chłonność, także oleistych substancji Niskopylne i odporne na rozerwania Współpracuje z rozpuszczalnikami, ograniczając ich zużycie Polecane do stosowania w przemyśle maszynowym, poligraficznym, spożywczym  nawet do najcięższych zadań związanych z czyszczeniem Atest PZH i certyfikat ISEGA, zezwalający na stosowanie produktu w przemyśle spożywczym W wygodnym kartonie mogącym służyć jako dozownik Perforacja co 38 cm Materiał: włóknina jednowarstwowa Tłoczenie: nie Ilość listków: 280  szerokość listka: 320 mm Długość roli: 106,4 m  średnica r[...]","szt",{"$f":"IF('Załącznik 13-F.O. Zad 11-15 '!$V$55,VLOOKUP(C40,'Załącznik 13-F.O. Zad 11-15 '!$C$52:$G$174,5,0),0)","v":0},4,0,1,0,0,0,2,0,null,0,null,0,1,0,null,0]
[null,20,"Kij z mopem sznurkowym, 1 komplet","Kij z mopem sznurkowym, Waga: 345 g, Jednostka sprzedaży: 1 sztuka","szt",{"$f":"IF('Załącznik 13-F.O. Zad 11-15 '!$V$55,VLOOKUP(C41,'Załącznik 13-F.O. Zad 11-15 '!$C$52:$G$174,5,0),0)","v":0},14,0,3,0,5,0,5,0,null,0,null,0,1,0,null,0]
[null,21,"Nakładka CEG z mikrofibry na mop triple, długość 40 cm","Mop trójskładnikowy DUO (kieszeń + klips), Wykonany z bawełny, mikrowłókna i poliestru, Długość: 40 cm","szt",{"$f":"IF('Załącznik 13-F.O. Zad 11-15 '!$V$55,VLOOKUP(C42,'Załącznik 13-F.O. Zad 11-15 '!$C$52:$G$174,5,0),0)","v":0},31,0,null,0,27,0,3,0,null,0,null,0,1,0,null,0]
[null,22,"Ściereczki gąbczaste niebieskie, 3 sztuki","Bardzo trwałe i chłonne ścierki gąbczaste, wzmocnione wewnętrzną bawełnianą siatką, Najlepsze do wycierania wody, zmywania powierzchni i usuwania brudu","op. (3 szt)",{"$f":"IF('Załącznik 13-F.O. Zad 11-15 '!$V$55,VLOOKUP(C43,'Załącznik 13-F.O. Zad 11-15 '!$C$52:$G$174,5,0),0)","v":0},43,0,5,0,0,0,6,0,20,0,null,0,1,0,11,0]
[null,23,"Ścierka do podłogi, 50 x 60 cm, pomarańczowa","Ścierka do podłogi, 50 x 60 cm, pomarańczowaWymiary: 50 x 60 cm, Do czyszczenia dużych powierzchni","szt",{"$f":"IF('Załącznik 13-F.O. Zad 11-15 '!$V$55,VLOOKUP(C44,'Załącznik 13-F.O. Zad 11-15 '!$C$52:$G$174,5,0),0)","v":0},7,0,null,0,0,0,4,0,null,0,1,0,1,0,1,0]
[null,24,"Ścierka z mikrofibry KOLORADO, 35 x 35 cm","Ścierka z mikrofibry przeznaczona do czyszczenia powierzchni szklanych i stosowania w łazience, Skuteczna na sucho i mokro, Nie pozostawia smug, zacieków ani kłaczków, Skład: 80% poliester, 20% poliamid (nylon)","szt",{"$f":"IF('Załącznik 13-F.O. Zad 11-15 '!$V$55,VLOOKUP(C45,'Załącznik 13-F.O. Zad 11-15 '!$C$52:$G$174,5,0),0)","v":0},47,0,null,0,18,0,15,0,null,0,13,0,1,0,null,0]
[null,25,"Ścierki uniwersalne Practi Maxi 50sztuk","Ścierki uniwersalne Practi Maxi 50sztuk rozmiar 25 x 40","op (50 szt)",{"$f":"IF('Załącznik 13-F.O. Zad 11-15 '!$V$55,VLOOKUP(C46,'Załącznik 13-F.O. Zad 11-15 '!$C$52:$G$174,5,0),0)","v":0},6,0,null,0,0,0,3,0,null,0,null,0,1,0,2,0]
[null,26,"Ścierki uniwersalne, 5 sztuk","Ścierki wielokrotnego użytku Można je prać i sterylizować Wykonane z wiskozy, pachnące Miks kolorów Wymiary: 37 x 38 cm","op (5 szt)",{"$f":"IF('Załącznik 13-F.O. Zad 11-15 '!$V$55,VLOOKUP(C47,'Załącznik 13-F.O. Zad 11-15 '!$C$52:$G$174,5,0),0)","v":0},47,0,6,0,18,0,12,0,10,0,null,0,1,0,null,0]
[null,27,"Proszek do prania tkanin kolorowych DOSIA, 300 g","Proszek do prania tkanin kolorowych do wszystkich typów pralek i do prania ręcznego\nZawiera enzymy i aktywne składniki piorące\nNie zawiera chlorowych wybielaczy: jest delikatna dla kolorowych i ciemnych tkanin\nJednostka sprzedaży: 1 sztuka (300 g)","op (300g)",{"$f":"IF('Załącznik 13-F.O. Zad 11-15 '!$V$55,VLOOKUP(C48,'Załącznik 13-F.O. Zad 11-15 '!$C$52:$G$174,5,0),0)","v":0},329,0,null,0,300,0,2,0,null,0,26,0,1,0,null,0]
[null,28,"Proszek do prania tkanin PUROX, 5 kg","Do wszystkich typów pralek i do prania ręcznego, Jednostka sprzedaży: 1 opakowanie (5 kg), Składniki: do 5% anionowe i niejonowe środki powierzchniowo czynne, enzymy, kompozycja zapachowa, krzemiany, niejonowe środki powierzchniowo, czynne, regulatory piany, rozjaśniacze optyczne, związki wybielające na bazie tlenu","op (5 kg)",{"$f":"IF('Załącznik 13-F.O. Zad 11-15 '!$V$55,VLOOKUP(C49,'Załącznik 13-F.O. Zad 11-15 '!$C$52:$G$174,5,0),0)","v":0},14,0,null,0,0,0,0,0,null,0,13,0,1,0,null,0]
[null,29,"Chusteczki FELLOWES do czyszczenia ekranów, opakowanie 100szt","Chusteczki FELLOWES do czyszczenia ekranów, opakowanie 100szt","op (100 szt)",{"$f":"IF('Załącznik 13-F.O. Zad 11-15 '!$V$55,VLOOKUP(C50,'Załącznik 13-F.O. Zad 11-15 '!$C$52:$G$174,5,0),0)","v":0},30,0,10,0,0,0,14,0,5,0,null,0,1,0,null,0]
[null,30,"Płyn AJAX Floral Fiesta, 1 l","Doskonale usuwa kurz i brud, pozostawiając na długo świeży zapach Miks zapachów Pojemność: 1 l Jednostka sprzedaży 1 sztuka","op (1l)",{"$f":"IF('Załącznik 13-F.O. Zad 11-15 '!$V$55,VLOOKUP(C51,'Załącznik 13-F.O. Zad 11-15 '!$C$52:$G$174,5,0),0)","v":0},98,0,null,0,90,0,7,0,null,0,null,0,1,0,null,0]
[null,31,"Preparat do usuwania tłustego brudu VOIGT C457 Ultra Clean plus 1 l","Odtłuszczanie, gruntowne mycie bez fosforanów – Produkt do profesjonalnego zastosowania, Nie zawierający fosforanów, Usuwa zabrudzenia pochodzenia tłuszczowego i przemysłowego m.in. oleje, smary. Zalecany do: warsztatów, hal produkcyjnych, galerii handlowych, centrów logistycznych","op (1l)",{"$f":"IF('Załącznik 13-F.O. Zad 11-15 '!$V$55,VLOOKUP(C52,'Załącznik 13-F.O. Zad 11-15 '!$C$52:$G$174,5,0),0)","v":0},1,0,null,0,0,0,0,0,null,0,null,0,1,0,null,0]
[null,32,"Rozpuszczalnik do etykiet w sprayu, pojemność 200 ml","Produkt zapewnia w pełni bezpieczne usunięcie etykiet z dowolnej powierzchni, nie pozostawiając żadnych, śladów kleju. Pojemność 200 ml.","op (200 ml)",{"$f":"IF('Załącznik 13-F.O. Zad 11-15 '!$V$55,VLOOKUP(C53,'Załącznik 13-F.O. Zad 11-15 '!$C$52:$G$174,5,0),0)","v":0},9,0,1,0,0,0,7,0,null,0,null,0,1,0,null,0]
[null,33,"Gąbka do zmywania różowa, 5 sztuk","Gąbka do różnorodnych zastosowań, Kolor: różowy","op (5 szt)",{"$f":"IF('Załącznik 13-F.O. Zad 11-15 '!$V$55,VLOOKUP(C54,'Załącznik 13-F.O. Zad 11-15 '!$C$52:$G$174,5,0),0)","v":0},60,0,31,0,20,0,8,0,null,0,null,0,1,0,null,0]
[null,34,"Gąbki do zmywania standardowa, 5 sztuk","Do zmywania naczyń, szkła, ceramiki, powierzchni emaliowanych Wytrzymała Miks kolorów w opakowaniu Jednostka sprzedaży: 1 opakowanie (5 sztuk) Opakowanie zbiorcze: 18 opakowań","op (5 szt)",{"$f":"IF('Załącznik 13-F.O. Zad 11-15 '!$V$55,VLOOKUP(C55,'Załącznik 13-F.O. Zad 11-15 '!$C$52:$G$174,5,0),0)","v":0},322,0,29,0,20,0,42,0,17,0,213,0,1,0,null,0]
[null,35,"Kuchenka mikrofalowa SEVERIN 7890/7862, biała","5 poziomów mocy, Rozmrażanie w oparciu o czas i wagę, 35-minutowy timer z sygnałem akustycznym, Pokrętło regulacyjne z chromowanymi elementami, Średnica wyjmowanego talerza ok. 25,4 cm, Wysokość komory ok. 16,5 cm, Obudowa i komora lakierowana powłoką odporną na wysokie temperatur, Wymiary: szer. 43,5, gł. 34,5, wys. 25,4 cm, Moc: 700 W","szt",{"$f":"IF('Załącznik 13-F.O. Zad 11-15 '!$V$55,VLOOKUP(C56,'Załącznik 13-F.O. Zad 11-15 '!$C$52:$G$174,5,0),0)","v":0},7,0,null,0,0,0,4,0,2,0,null,0,1,0,null,0]
[null,36,"Jednorazowa maska higieniczna 3-warstwowa, niebieska, 50 sztuk","Trójwarstwowa maska higieniczna. Wykonana z włókniny polipropylenowej (100%). Materiał: Texfil 25 (Spunbond) + Texfil 25 (Spunbond) + Texfil 25 (Spunbond). Gramatura: 25 gsm + 25 gsm + 25 gsm= 75 gsm. Gumki – długość 16cm - 18cm (± 1cm).","op (50szt)",{"$f":"IF('Załącznik 13-F.O. Zad 11-15 '!$V$55,VLOOKUP(C57,'Załącznik 13-F.O. Zad 11-15 '!$C$52:$G$174,5,0),0)","v":0},176,0,111,0,0,0,14,0,50,0,null,0,1,0,null,0]
[null,37,"Półmaska FILTERSERVICE FS-623V NR D, FFP2, z zaworem, 10 sztuk","Czasza półmaski: - Igłowana włóknina poliestrowa,  - Włóknina polipropylenowa typu melt blown, - Włóknina osłonowa, - Zawór wydechowy, - Zapinki taśm nagłowia, - Taśma nagłowia","op (10szt)",{"$f":"IF('Załącznik 13-F.O. Zad 11-15 '!$V$55,VLOOKUP(C58,'Załącznik 13-F.O. Zad 11-15 '!$C$52:$G$174,5,0),0)","v":0},1,0,null,0,0,0,0,0,null,0,null,0,1,0,null,0]
[null,38,"Nawilżacz powietrza NU 5N","4 poziomy intensywności nawilżania, Automatyczna kontrola wilgotności, Demontowany zasobnik wody 5,2 l, Funkcja jonizacji","szt",{"$f":"IF('Załącznik 13-F.O. Zad 11-15 '!$V$55,VLOOKUP(C59,'Załącznik 13-F.O. Zad 11-15 '!$C$52:$G$174,5,0),0)","v":0},9,0,4,0,0,0,4,0,null,0,null,0,1,0,null,0]
[null,39,"Odświeżacz powietrza AMBI PUR, zapach kwiatowy, 300 ml","Wypełnia pomieszczenie zapachem najpiękniejszego wiosennego bukietu Pojemność: 300 ml Jednostka sprzedaży: 1 sztuka Opakowanie zbiorcze: 6 sztuk","szt",{"$f":"IF('Załącznik 13-F.O. Zad 11-15 '!$V$55,VLOOKUP(C60,'Załącznik 13-F.O. Zad 11-15 '!$C$52:$G$174,5,0),0)","v":0},148,0,18,0,108,0,11,0,10,0,null,0,1,0,null,0]
[null,40,"Odświeżacz powietrza BRISE w sprayu","Odświeżając pomieszczenia pozostawia przyjemny zapach Pojemność: 300 ml Jednostka sprzedaży: 1 sztuka ","szt.",{"$f":"IF('Załącznik 13-F.O. Zad 11-15 '!$V$55,VLOOKUP(C61,'Załącznik 13-F.O. Zad 11-15 '!$C$52:$G$174,5,0),0)","v":0},87,0,16,0,0,0,0,0,10,0,60,0,1,0,null,0]
[null,41,"Odświeżacz powietrza BRISE w żelu, miks zapachów","Masa netto: 150 g Miks zapachów Jednostka sprzedaży: 1 sztuka ","szt.",{"$f":"IF('Załącznik 13-F.O. Zad 11-15 '!$V$55,VLOOKUP(C62,'Załącznik 13-F.O. Zad 11-15 '!$C$52:$G$174,5,0),0)","v":0},19,0,2,0,0,0,3,0,null,0,13,0,1,0,null,0]
[null,42,"Odświeżacz powietrza GREEN FRESH, 400 ml","Skutecznie neutralizuje i pochłania nieprzyjemne zapachy\nOdświeża i nawilża powietrze, pozostawiając w pomieszczeniu uczucie świeżości i czystości Pojemność: 400 ml Jednostka sprzedaży: 1 sztuka","op. (400 ml)",{"$f":"IF('Załącznik 13-F.O. Zad 11-15 '!$V$55,VLOOKUP(C63,'Załącznik 13-F.O. Zad 11-15 '!$C$52:$G$174,5,0),0)","v":0},5,0,null,0,0,0,4,0,null,0,null,0,1,0,null,0]
[null,43,"Patyczki zapachowe PACHNĄCA SZAFA, Słoneczne popołudnie, 50 ml","Patyczki zapachowe PACHNĄCA SZAFA nadają przyjemny i odświeżający zapach w każdym pomieszczeniu. Odświeżać ma bardzo ładną formę eleganckich patyczków w szklanym flakoniku.","op (50 ml)",{"$f":"IF('Załącznik 13-F.O. Zad 11-15 '!$V$55,VLOOKUP(C64,'Załącznik 13-F.O. Zad 11-15 '!$C$52:$G$174,5,0),0)","v":0},19,0,null,0,10,0,8,0,null,0,null,0,1,0,null,0]
[null,44,"Wkład do odświeżacza AMBI PUR, zapach ocean and wind","Wkład do elektrycznego odświeżacza powietrza AMBI PUR (6.630.347) Wydajność wkładów: do 80 dni Jednostka sprzedaży: 1 sztuka ","szt",{"$f":"IF('Załącznik 13-F.O. Zad 11-15 '!$V$55,VLOOKUP(C65,'Załącznik 13-F.O. Zad 11-15 '!$C$52:$G$174,5,0),0)","v":0},5,0,null,0,0,0,4,0,null,0,null,0,1,0,null,0]
[null,45,"Papier toaletowy CLASSIC, biały, 8 rolek","Papier toaletowy CLASSIC, biały, 8 rolek Wymiary listka: szer. 100 x dł. 112 mm, Szerokość taśmy: 100 mm","op. (8 rolek)",{"$f":"IF('Załącznik 13-F.O. Zad 11-15 '!$V$55,VLOOKUP(C66,'Załącznik 13-F.O. Zad 11-15 '!$C$52:$G$174,5,0),0)","v":0},72,0,null,0,60,0,11,0,null,0,null,0,1,0,null,0]
[null,46,"Papier toaletowy ELLIS PROFESSIONAL JUMBO 130/2, 12 rolek","Papier do użytku profesjonalnego w pomieszczeniach o zwiększonym natężeniu użytkowania, Materiał: celuloza dwuwarstwowa, Gramatura: 2 x 16 g/m², Długość roli: 120 m; średnica roli: 19 cm; średnica gilzy: 6 cm","op (12 rolek)",{"$f":"IF('Załącznik 13-F.O. Zad 11-15 '!$V$55,VLOOKUP(C67,'Załącznik 13-F.O. Zad 11-15 '!$C$52:$G$174,5,0),0)","v":0},75,0,null,0,72,0,0,0,null,0,null,0,1,0,2,0]
[null,47,"Papier toaletowy KATRIN 11296 PLUS 160, biały, 8 rolek","Papier toaletowy KATRIN 11296 PLUS 160, biały, 8 rolek Gramatura: 2 x 16,5 g/m², Długość jednej rolki: 18,3 m","op. (8 rolek)",{"$f":"IF('Załącznik 13-F.O. Zad 11-15 '!$V$55,VLOOKUP(C68,'Załącznik 13-F.O. Zad 11-15 '!$C$52:$G$174,5,0),0)","v":0},41,0,null,0,40,0,0,0,null,0,null,0,1,0,null,0]
[null,48,"Supermocny Plaster do cięcia VISCOPLAST, 1 m x 8 cm","Opatrunek włókninowy o wysokiej chłonności, Plaster natychmiast przykleja się do skóry, nawet do wilgotnej, Ogranicza przywieranie opatrunku do rany","op (1m)",{"$f":"IF('Załącznik 13-F.O. Zad 11-15 '!$V$55,VLOOKUP(C69,'Załącznik 13-F.O. Zad 11-15 '!$C$52:$G$174,5,0),0)","v":0},10,0,5,0,2,0,2,0,null,0,null,0,1,0,null,0]
[null,49,"Uniwersalny zestaw plastrów 3M VISCOPLAST, 24 sztuki","Plastry z opatrunkiem do opatrywania drobnych ran i skaleczeń Hypoalergiczne i wodoodporne Przepuszczające powietrze W opakowaniu 24 plastry: plastry Minifol: 72 x 25 mm - 4 sztuki, 72 x 19 mm - 8 sztuk, 57 x 16 mm - 6 sztuk, 38x10 mm - 4 sztuki Plaster Prestopor 10 x 6 cm Plaster Prestovis Plus 10 x 6 cm Jednostka sprzedaży: 1 opakowanie","op. ( 24 szt)",{"$f":"IF('Załącznik 13-F.O. Zad 11-15 '!$V$55,VLOOKUP(C70,'Załącznik 13-F.O. Zad 11-15 '!$C$52:$G$174,5,0),0)","v":0},28,0,6,0,2,0,4,0,10,0,null,0,1,0,5,0]
[null,50,"Krem do rąk EVELINE ''Niewidzialne rękawiczki'', 100 ml","Odżywczo-ochronny krem do rąk z formułą witaminową Polecany do suchych i podrażnionych dłoni Pojemność: 100 ml Jednostka sprzedaży: 1 sztuka ","op do (100 ml)",{"$f":"IF('Załącznik 13-F.O. Zad 11-15 '!$V$55,VLOOKUP(C71,'Załącznik 13-F.O. Zad 11-15 '!$C$52:$G$174,5,0),0)","v":0},451,0,null,0,450,0,0,0,null,0,null,0,1,0,null,0]
[null,51,"Krem do rąk GARNIER do skóry bardzo suchej, 100 g","Regeneruje i odżywia zniszczoną skórę dłoni Zawiera alantoinę, glicerynę oraz czynnik filtrującyJednostka sprzedaży: 1 sztuka (100 g)","op. (100 g)",{"$f":"IF('Załącznik 13-F.O. Zad 11-15 '!$V$55,VLOOKUP(C72,'Załącznik 13-F.O. Zad 11-15 '!$C$52:$G$174,5,0),0)","v":0},1714,0,null,0,1000,0,0,0,710,0,3,0,1,0,null,0]
[null,52,"Ręcznik MALFINI, chabrowy, 70x140 cm","Tkana metka, która może również służyć jako wieszaczek, Ozdobiony wyszywaną bordiurą po obu brzegach, Sklad: 100% bawełna, frotte, Gramatura: 450g/m², Kolor: chabrowy, Rozmiar: 70x140 cm","szt",{"$f":"IF('Załącznik 13-F.O. Zad 11-15 '!$V$55,VLOOKUP(C73,'Załącznik 13-F.O. Zad 11-15 '!$C$52:$G$174,5,0),0)","v":0},121,0,null,0,{"$f":"40*1.8","v":72},0,2,0,null,0,46,0,1,0,null,0]
[null,53,"Ręcznik MALFINI, granatowy, 50x100 cm","Tkana metka, która może również służyć jako wieszaczek, Ozdobiony wyszywaną bordiurą po obu brzegach, Sklad: 100% bawełna, frotte, Gramatura: 450g/m², Kolor: granatowy","szt",{"$f":"IF('Załącznik 13-F.O. Zad 11-15 '!$V$55,VLOOKUP(C74,'Załącznik 13-F.O. Zad 11-15 '!$C$52:$G$174,5,0),0)","v":0},76,0,null,0,0,0,0,0,75,0,null,0,1,0,null,0]
[null,54,"Ręcznik MALFINI, szaro-czarny, 50x100 cm","Wykonane z wysokiej jakości frotte, odpowiednie pod haft, Miękkie, miłe w dotyku, dobrze absorbują wodę, Tkana metka, która może również służyć jako wieszaczek, Ozdobiony wyszywaną bordiurą po obu brzegach, Sklad: 100% bawełna, frotte, Gramatura: 450g/m² kolor szaroczany ","szt",{"$f":"IF('Załącznik 13-F.O. Zad 11-15 '!$V$55,VLOOKUP(C75,'Załącznik 13-F.O. Zad 11-15 '!$C$52:$G$174,5,0),0)","v":0},76,0,null,0,0,0,0,0,75,0,null,0,1,0,null,0]
[null,55,"Ręcznik MALFINI, szaro-czarny, 70x140 cm","Tkana metka, która może również służyć jako wieszaczek, Ozdobiony wyszywaną bordiurą po obu brzegach, Sklad: 100% bawełna, frotte, Gramatura: 450g/m², Kolor: szaroczarny Rozmiar: 70x140 cm","szt",{"$f":"IF('Załącznik 13-F.O. Zad 11-15 '!$V$55,VLOOKUP(C76,'Załącznik 13-F.O. Zad 11-15 '!$C$52:$G$174,5,0),0)","v":0},68,0,null,0,{"$f":"15*1.8","v":27},0,0,0,null,0,40,0,1,0,null,0]
[null,56,"Chusteczki higieniczne VELVET, 120 sztuk","Chusteczki higieniczne VELVET, 120 sztuk. W opakowaniu 120 sztuk, Produkt ma atest PZH, ","op (120 szt)",{"$f":"IF('Załącznik 13-F.O. Zad 11-15 '!$V$55,VLOOKUP(C77,'Załącznik 13-F.O. Zad 11-15 '!$C$52:$G$174,5,0),0)","v":0},98,0,1,0,70,0,14,0,10,0,2,0,1,0,null,0]
[null,57,"Ręcznik w roli ESTIMO 100/2, 500 listków","Wytrzymały, dwuwarstwowy ręcznik w 100% wykonany z celulozy o wysokich parametrach i pięknym designie Długość rolki: 100 m W rolce 500 odcinków o wymiarach: 20,3 x 20 cm Kolor biały Jednostka sprzedaży: 1 rolka ","op. (rolka 100 m)",{"$f":"IF('Załącznik 13-F.O. Zad 11-15 '!$V$55,VLOOKUP(C78,'Załącznik 13-F.O. Zad 11-15 '!$C$52:$G$174,5,0),0)","v":0},209,0,null,0,190,0,18,0,null,0,null,0,1,0,null,0]
[null,58,"Ręczniki papierowe białe, składka V, 20 x 200 listków","Gofrowane ręczniki w składce Kompatybilne ze standardowymi dozownikami do ręczników typu ZZ Materiał: makulatura jednowarstwowa Wymiary listka: 25 x 23 cm Gramatura: 1 x 30 g/m² Ilość bind w opakowaniu: 20 Ilość listków w bindzie: 200 Kolor: biały Jednostka sprzedaży: 1 karton (4000 listków)","op. (20 x 200 listków)",{"$f":"IF('Załącznik 13-F.O. Zad 11-15 '!$V$55,VLOOKUP(C79,'Załącznik 13-F.O. Zad 11-15 '!$C$52:$G$174,5,0),0)","v":0},23,0,null,0,17,0,5,0,null,0,null,0,1,0,null,0]
[null,59,"Ręczniki papierowe MERIDA składka V, 20 x 160 listków","Gofrowane ręczniki w składce wysokiej chłonności Kompatybilne ze standardowymi dozownikami do ręczników typu ZZ Materiał: makulatura dwuwarstwowa Wymiary listka: 25 x 23 cm Gramatura:2 x 19 g/m² Tłoczenie: nie Ilość bind w opakowaniu: 20 Ilość listków w bindzie: 160 Kolor: biały Jednostka sprzedaży: 1 karton (3200 listków)","op. (20 x 160 listków)",{"$f":"IF('Załącznik 13-F.O. Zad 11-15 '!$V$55,VLOOKUP(C80,'Załącznik 13-F.O. Zad 11-15 '!$C$52:$G$174,5,0),0)","v":0},44,0,null,0,40,0,3,0,null,0,null,0,1,0,null,0]
[null,60,"Ręczniki papierowe zielone, składka V, 20 x 200 listków","Gofrowane ręczniki w składce wysokiej chłonności Kompatybilne ze standardowymi dozownikami do ręczników typu ZZ Materiał: makulatura jednowarstwowa Wymiary listka: 25 x 23 cm Gramatura:2 x 19 g/m² Tłoczenie: nie Ilość bind w opakowaniu: 20 Ilość listków w bindzie: 160 Kolor: zielon. ","op. (20 x 200 listków)",{"$f":"IF('Załącznik 13-F.O. Zad 11-15 '!$V$55,VLOOKUP(C81,'Załącznik 13-F.O. Zad 11-15 '!$C$52:$G$174,5,0),0)","v":0},1,0,null,0,0,0,0,0,null,0,null,0,1,0,null,0]
[null,61,"Ręczniki w roli TORK UNIVERSAL Extra Długie do systemu TORK Matic H1, 6 rolek","Materiał: makulatura jednowarstwowa, Tłoczenie: nie, Ilość listków:1120, Długość roli: 280 m; wysokość roli: 21 cm; średnica roli: 19 cm; średnica gilzy: 3,8 cm","op. (6 rolek)",{"$f":"IF('Załącznik 13-F.O. Zad 11-15 '!$V$55,VLOOKUP(C82,'Załącznik 13-F.O. Zad 11-15 '!$C$52:$G$174,5,0),0)","v":0},143,0,88,0,54,0,0,0,null,0,null,0,1,0,null,0]
[null,62,"Rękawice antystatyczne ANSELL HyFlex® 11-800, rozmiar 9, para","Nylonowe rękawice z powłoką z pianki nitrylowej, wykonane w technologii KnitZonz™ Wszechstronne rozwiązanie do precyzyjnego montażu i prac ogólnych Zaawansowana technologia dziania zapewnia większą rozciągliwość i elastyczność w miejscach o zwiększonym nacisku Antystatyczne, zgodne z normą EN 1149 Norma EN 388 3131 (EN 388:2016 3131A) Rozmiar: 9 Jednostka sprzedaży: 1 para ","op. (1 para)",{"$f":"IF('Załącznik 13-F.O. Zad 11-15 '!$V$55,VLOOKUP(C83,'Załącznik 13-F.O. Zad 11-15 '!$C$52:$G$174,5,0),0)","v":0},16,0,null,0,2,0,0,0,null,0,10,0,1,0,3,0]
[null,63,"Rękawice DELTAPLUS VV835 Chemsafe, rozmiar 11, para","Rękawica z podwójną powłoką nitrylową na wkładzie z poliamidu, Trzecia powłoka z szorstkiej pianki nitrylowej na stronie chwytnej i końcach palców, Długość: 35 cm, Grubość: 1,15 mm - 1,30 mm na stronie chwytnej","op, 1 (para)",{"$f":"IF('Załącznik 13-F.O. Zad 11-15 '!$V$55,VLOOKUP(C84,'Załącznik 13-F.O. Zad 11-15 '!$C$52:$G$174,5,0),0)","v":0},4,0,null,0,0,0,0,0,null,0,null,0,1,0,3,0]
[null,64,"Rękawice nitrylowe MEDASEPT PF, czarne, rozmiar S, 100 sztuk","Uniwersalne, rękawice pasujące na prawą i lewą dłoń, Nitrylowe, Tekstura na końcach palców, Rozmiar S","op. (100 szt)",{"$f":"IF('Załącznik 13-F.O. Zad 11-15 '!$V$55,VLOOKUP(C85,'Załącznik 13-F.O. Zad 11-15 '!$C$52:$G$174,5,0),0)","v":0},100,0,34,0,0,0,7,0,null,0,53,0,1,0,5,0]
[null,65,"Rękawice nitrylowe MEDASEPT PREMIER, niebieskie, rozmiar XL, 100 sztuk","Rękawice nitrylowe diagnostyczne i ochronne (kat. III), Bezpudrowe., Uniwersalny kształt pasuje na obie dłonie, Tekstura na końcach palców, Przeznaczone do kontaktu z żywnością.","op. (100 szt)",{"$f":"IF('Załącznik 13-F.O. Zad 11-15 '!$V$55,VLOOKUP(C86,'Załącznik 13-F.O. Zad 11-15 '!$C$52:$G$174,5,0),0)","v":0},64,0,5,0,null,0,0,0,null,0,53,0,1,0,5,0]
[null,66,"Rękawice nitrylowe MEDASEPT PRIME, niebieskie, rozmiar L, 100 sztuk","Rękawice nitrylowe diagnostyczne i ochronne, Bezpudrowe. Uniwersalny kształt pasuje na obie dłonie. ","op. (100 szt)",{"$f":"IF('Załącznik 13-F.O. Zad 11-15 '!$V$55,VLOOKUP(C87,'Załącznik 13-F.O. Zad 11-15 '!$C$52:$G$174,5,0),0)","v":0},{"$f":"I87+K87+M87+O87+Q87+S87+U87","v":79},{"$f":"G87*F87","v":0},20,{"$f":"I87*F87","v":0},0,{"$f":"K87*F87","v":0},0,{"$f":"M87*F87","v":0},null,{"$f":"O87*F87","v":0},53,{"$f":"Q87*F87","v":0},1,{"$f":"S87*F87","v":0},5,{"$f":"U87*F87","v":0}]
[null,67,"Rękawice nitrylowe MEDASEPT PRIME, niebieskie, rozmiar M, 100 sztuk","Rękawice nitrylowe diagnostyczne i ochronne","op. (100 szt)",{"$f":"IF('Załącznik 13-F.O. Zad 11-15 '!$V$55,VLOOKUP(C88,'Załącznik 13-F.O. Zad 11-15 '!$C$52:$G$174,5,0),0)","v":0},93,0,34,0,0,0,0,0,null,0,53,0,1,0,5,0]
[null,68,"Ręcznik kuchenny VELVET Jumbo, 1 rolka","Dwuwarstwowy ręcznik papierowy, który świetnie nadaje się do generalnych porządków, prac w garażu, ogrodzie oraz w kuchni Giga rola = 13 standardowych rolek Nie tylko chłonny i wytrzymały, ale także wyjątkowo wydajny Jedna rolka zawiera aż 520 listków Wysokość rolki: 22 cm Kolor biały Jednostka sprzedaży: 1 rolka ","szt ( 1 rolka)",{"$f":"IF('Załącznik 13-F.O. Zad 11-15 '!$V$55,VLOOKUP(C89,'Załącznik 13-F.O. Zad 11-15 '!$C$52:$G$174,5,0),0)","v":0},27,0,null,0,0,0,6,0,15,0,null,0,1,0,5,0]
[null,69,"Ręcznik papierowy BRATEK biały, 2 rolki","Ręczniki kuchenne, dwuwarstwowe, celulozowe Szerokość rolki: 22 cm Długość rolki: 11 m Jednostka sprzedaży: 1 opakowanie (2 sztuki)","op (2 rolki)",{"$f":"IF('Załącznik 13-F.O. Zad 11-15 '!$V$55,VLOOKUP(C90,'Załącznik 13-F.O. Zad 11-15 '!$C$52:$G$174,5,0),0)","v":0},3,0,null,0,0,0,2,0,null,0,null,0,1,0,null,0]
[null,70,"Ręczniki kuchenne AHA, 2 rolki","Dwuwarstwowy ręcznik wykonany z czystej celulozy W rolce 50 odcinków o wymiarach: 23 x 20 cm W opakowaniu: 2 rolki Kolor biały Jednostka sprzedaży: 1 opakowanie ","op (2 rolki)",{"$f":"IF('Załącznik 13-F.O. Zad 11-15 '!$V$55,VLOOKUP(C91,'Załącznik 13-F.O. Zad 11-15 '!$C$52:$G$174,5,0),0)","v":0},13,0,null,0,0,0,6,0,null,0,6,0,1,0,null,0]
[null,71,"Ręczniki kuchenne VELVET, 2 rolki","Produkt wolny od bisfenolu A (BPA FREE), posiada atest NIZP-PZH","op. (2 rolki)",{"$f":"IF('Załącznik 13-F.O. Zad 11-15 '!$V$55,VLOOKUP(C92,'Załącznik 13-F.O. Zad 11-15 '!$C$52:$G$174,5,0),0)","v":0},221,0,11,0,160,0,26,0,null,0,23,0,1,0,null,0]
[null,72,"Łyżeczki do herbaty AMEFA Bologna, 12 sztuk","subtelne i eleganckie łyżeczki do herbaty, Sztućce polerowane, stal 18/0","op (12 szt)",{"$f":"IF('Załącznik 13-F.O. Zad 11-15 '!$V$55,VLOOKUP(C93,'Załącznik 13-F.O. Zad 11-15 '!$C$52:$G$174,5,0),0)","v":0},14,0,1,0,0,0,12,0,null,0,null,0,1,0,null,0]
[null,73,"Łyżeczki do kawy AMEFA Bologna, 12 sztuk","Klasyczne, proste w formie, subtelne i eleganckie łyżeczki do kawy Dobra jakość w atrakcyjnej cenie powodują, iż linia od lat cieszy się wyjątkową popularnością  Sztućce polerowane, stal 18/0","op (12 szt)",{"$f":"IF('Załącznik 13-F.O. Zad 11-15 '!$V$55,VLOOKUP(C94,'Załącznik 13-F.O. Zad 11-15 '!$C$52:$G$174,5,0),0)","v":0},5,0,1,0,0,0,3,0,null,0,null,0,1,0,null,0]
[null,74,"Łyżki AMEFA Bologna, 12 sztuk","Sztućce polerowane, stal 18/0","op (12 szt)",{"$f":"IF('Załącznik 13-F.O. Zad 11-15 '!$V$55,VLOOKUP(C95,'Załącznik 13-F.O. Zad 11-15 '!$C$52:$G$174,5,0),0)","v":0},7,0,1,0,0,0,5,0,null,0,null,0,1,0,null,0]
[null,75,"Widelce AMEFA Bologna, 12 sztuk","\nSztućce polerowane, stal 18/0, ","op (12 szt)",{"$f":"IF('Załącznik 13-F.O. Zad 11-15 '!$V$55,VLOOKUP(C96,'Załącznik 13-F.O. Zad 11-15 '!$C$52:$G$174,5,0),0)","v":0},6,0,1,0,0,0,4,0,null,0,null,0,1,0,null,0]
[null,76,"Ściereczki mokre do mebli drewnianych PRESTO, opakowanie 72 sztuki","Ściereczki nawilżane do czyszczenia różnych powierzchni, Usuwają kurz i zapobiegają jego osadzaniu, Nadają połysk czyszczonym powierzchniom","op. (72 szt)",{"$f":"IF('Załącznik 13-F.O. Zad 11-15 '!$V$55,VLOOKUP(C97,'Załącznik 13-F.O. Zad 11-15 '!$C$52:$G$174,5,0),0)","v":0},15,0,1,0,0,0,13,0,null,0,null,0,1,0,null,0]
[null,77,"Kulki do toalet BREF Power Activ, 50 g, zapach cytrynowy","Nowoczesne rozwiązanie w postaci czterech kulek na wygodnej zawieszce Czyszczą, pozostawiają przyjemny zapach i chronią przed osadzaniem się kamienia Masa netto: 50 g Jednostka sprzedaży: 1 sztuka Opakowanie zbiorcze: 10 sztuk","op. (50 g)",{"$f":"IF('Załącznik 13-F.O. Zad 11-15 '!$V$55,VLOOKUP(C98,'Załącznik 13-F.O. Zad 11-15 '!$C$52:$G$174,5,0),0)","v":0},221,0,null,0,50,0,4,0,null,0,166,0,1,0,null,0]
[null,78,"Kulki do toalet BREF Power Activ, 50 g, zapach morski","Nowoczesne rozwiązanie w postaci czterech kulek na wygodnej zawieszce Czyszczą, pozostawiają przyjemny zapach i chronią przed osadzaniem się kamienia Masa netto: 50 g Jednostka sprzedaży: 1 sztuka ","op. (50 g)",{"$f":"IF('Załącznik 13-F.O. Zad 11-15 '!$V$55,VLOOKUP(C99,'Załącznik 13-F.O. Zad 11-15 '!$C$52:$G$174,5,0),0)","v":0},76,0,null,0,4,0,5,0,null,0,66,0,1,0,null,0]
[null,79,"Płyn CILIT Bang Kamień i brud, 750 ml","Żel CILIT kamień i brud z Turbo Power. Do czyszczenia wanien, kabin prysznicowych, płytek, toalet, armatury kuchennej i łazienkowej Usuwa kamień, rdzawe zacieki z twardej wody, osad z mydła i inne zabrudzenia Pojemność: 750 ml Jednostka sprzedaży: 1 sztuka","op. (750 ml)",{"$f":"IF('Załącznik 13-F.O. Zad 11-15 '!$V$55,VLOOKUP(C100,'Załącznik 13-F.O. Zad 11-15 '!$C$52:$G$174,5,0),0)","v":0},37,0,null,0,10,0,11,0,2,0,13,0,1,0,null,0]
[null,80,"Płyn do toalet DOMESTOS Toilet Limescale Remover, 750 ml","Gęsty płyn do czyszczenia muszli klozetowych Formuła ściśle przylegająca do czyszczonych powierzchni, rozpuszcza kamień wapienny Przeznaczony do powierzchni porcelanowych i szkliwionych Butelka z wygodnym dozownikiem Pojemność: 750 ml Jednostka sprzedaży: 1 sztuka Opakowanie zbiorcze: 6 sztuk","op. (750 ml)",{"$f":"IF('Załącznik 13-F.O. Zad 11-15 '!$V$55,VLOOKUP(C101,'Załącznik 13-F.O. Zad 11-15 '!$C$52:$G$174,5,0),0)","v":0},69,0,null,0,0,0,2,0,null,0,66,0,1,0,null,0]
[null,81,"Płyn do WC DOMESTOS 24H, 1,25 l, cytrynowy","Produkt czyszcząco-dezynfekująco-wybielający Możliwość stosowania do: muszli klozetowych, umywalek, zlewów itp. Produkt nadaje się także do wybielania tkanin Jednostka sprzedaży: 1 sztuka Pojemność: 1,25 l ","op. (1,25 l)",{"$f":"IF('Załącznik 13-F.O. Zad 11-15 '!$V$55,VLOOKUP(C102,'Załącznik 13-F.O. Zad 11-15 '!$C$52:$G$174,5,0),0)","v":0},130,0,18,0,40,0,5,0,null,0,66,0,1,0,null,0]
[null,82,"Płyn do WC DOMESTOS 24H, 1,25 l, leśny","Produkt czyszcząco-dezynfekująco-wybielający Możliwość stosowania do: muszli klozetowych, umywalek, zlewów itp. Produkt nadaje się także do wybielania tkanin Pojemność: 1,25 l Jednostka sprzedaży: 1 sztuka ","op. (1,25 l)",{"$f":"IF('Załącznik 13-F.O. Zad 11-15 '!$V$55,VLOOKUP(C103,'Załącznik 13-F.O. Zad 11-15 '!$C$52:$G$174,5,0),0)","v":0},59,0,18,0,40,0,0,0,null,0,null,0,1,0,null,0]
[null,83,"Wkład zapachowy do pisuarów MERIDA, czerwony","Winylowy, elastyczny wkład zapachowy do pisuarów, Zapach utrzymuje się przez około 30 dni, Dodatkowo wkład zabezpiecza pisuar przed zapchaniem","szt.",{"$f":"IF('Załącznik 13-F.O. Zad 11-15 '!$V$55,VLOOKUP(C104,'Załącznik 13-F.O. Zad 11-15 '!$C$52:$G$174,5,0),0)","v":0},24,0,null,0,20,0,3,0,null,0,null,0,1,0,null,0]
[null,84,"Zawieszka do WC DOMESTOS, zapach leśny","Zawieszki czyszczące do toalet Chronią przed osadzaniem się kamienia i pozostawiają świeży zapach Jednostka sprzedaży 1 sztuka ","szt",{"$f":"IF('Załącznik 13-F.O. Zad 11-15 '!$V$55,VLOOKUP(C105,'Załącznik 13-F.O. Zad 11-15 '!$C$52:$G$174,5,0),0)","v":0},19,0,4,0,0,0,13,0,null,0,1,0,1,0,null,0]
[null,85,"Żel BREF do WC Fresh Mist, 700 ml","Usuwa kamień, brud i osad, Gęsta formuła żelu sprawia, że działa on również pod powierzchnią wody.","op. (700 ml)",{"$f":"IF('Załącznik 13-F.O. Zad 11-15 '!$V$55,VLOOKUP(C106,'Załącznik 13-F.O. Zad 11-15 '!$C$52:$G$174,5,0),0)","v":0},33,0,null,0,24,0,2,0,null,0,6,0,1,0,null,0]
[null,86,"Żel CLINEX Drill do udrażniania odpływów, 1 l","Szybko rozpuszcza wszelkie stałe i organiczne zanieczyszczenia takie jak: tłuszcz, papier, wata, odpadki kuchenne, Forma żelowa pozwala na osadzanie się preparatu na ściankach rur, przedłużając proces działania, Likwiduje nieprzyjemne zapachy, Nadaje się do udrażniania rur zarówno w kuchni, jak i w łazience","op. (1 l)",{"$f":"IF('Załącznik 13-F.O. Zad 11-15 '!$V$55,VLOOKUP(C107,'Załącznik 13-F.O. Zad 11-15 '!$C$52:$G$174,5,0),0)","v":0},32,0,null,0,4,0,4,0,null,0,3,0,1,0,20,0]
[null,87,"Biobójczy płyn do dezynfekcji rąk HISKIN, 1 l","Produkt przeznaczony do codziennego stosowania przez użytkownika powszechnego. Wykazuje działanie bakteriobójcze, grzybobójcze i wirusobójcze","op. (1 l)",{"$f":"IF('Załącznik 13-F.O. Zad 11-15 '!$V$55,VLOOKUP(C108,'Załącznik 13-F.O. Zad 11-15 '!$C$52:$G$174,5,0),0)","v":0},100,0,10,0,0,0,3,0,null,0,66,0,1,0,20,0]
[null,88,"Dozownik do mydła w płynie MERIDA TOP, biały","Mocny i trwały dozownik do mydła w płynie wykonany z tworzywa ABS Okienko umożliwiające kontrolę zużycia mydła Pojemność: 0,8 l Zestaw do montażu w komplecie Wymiary: dł. 11,5 x szer.11,5 x wys. 25 cm Kolor: biały Jednostka sprzedaży: 1 sztuka","szt.",{"$f":"IF('Załącznik 13-F.O. Zad 11-15 '!$V$55,VLOOKUP(C109,'Załącznik 13-F.O. Zad 11-15 '!$C$52:$G$174,5,0),0)","v":0},13,0,null,0,4,0,5,0,3,0,null,0,1,0,null,0]
[null,89,"Mydło toaletowe NIVEA, 100 g","Kremowe mydło z odżywczym olejkiem migdałowym Miks zapachów Jednostka sprzedaży: 1 sztuka ","szt. (100 g)",{"$f":"IF('Załącznik 13-F.O. Zad 11-15 '!$V$55,VLOOKUP(C110,'Załącznik 13-F.O. Zad 11-15 '!$C$52:$G$174,5,0),0)","v":0},2040,0,null,0,1420,0,2,0,617,0,null,0,1,0,null,0]
[null,90,"Mydło w płynie MERIDA Silva, 5 l","Mydło w płynie typu „dwa w jednym”, Zawiera m.in. glukopony mające doskonałe właściwości pielęgnacyjne skóry, jak również gluadyny – roślinne proteiny, szczególnie cenne składniki pielęgnacyjne chroniące skórę i włosy","op. (5l)",{"$f":"IF('Załącznik 13-F.O. Zad 11-15 '!$V$55,VLOOKUP(C111,'Załącznik 13-F.O. Zad 11-15 '!$C$52:$G$174,5,0),0)","v":0},21,0,null,0,13,0,7,0,null,0,null,0,1,0,null,0]
[null,91,"Mydło w płynie PALMOLIVE, migdałowe, 300 ml","Dzięki naturalnemu pH nie podrażnia nawet wrażliwej skóry Zawiera kombinację substancji czyszczących i odżywczych Opakowanie z dozownikiem Pojemność 300 ml Jednostka sprzedaży: 1 sztuka Opakowanie zbiorcze: 12 sztuk","op. (300 ml)",{"$f":"IF('Załącznik 13-F.O. Zad 11-15 '!$V$55,VLOOKUP(C112,'Załącznik 13-F.O. Zad 11-15 '!$C$52:$G$174,5,0),0)","v":0},529,0,11,0,261,0,23,0,225,0,3,0,1,0,5,0]
[null,92,"Pasta BHP do rąk, ścierna, 500 g","Usuwa silne zabrudzenia smarami, tłuszczami, sadzami","op. (500g)",{"$f":"IF('Załącznik 13-F.O. Zad 11-15 '!$V$55,VLOOKUP(C113,'Załącznik 13-F.O. Zad 11-15 '!$C$52:$G$174,5,0),0)","v":0},62,0,null,0,0,0,0,0,48,0,13,0,1,0,null,0]
[null,93,"Pasta do rąk MERIDA PA12, 500 ml","Usuwa wszelkie zabrudzenia nawet powstałe od smarów i olejów, Oszczędna w użyciu, Jest niealkaliczna i nie zawiera mineralnych środków ściernych","op. (500 ml)",{"$f":"IF('Załącznik 13-F.O. Zad 11-15 '!$V$55,VLOOKUP(C114,'Załącznik 13-F.O. Zad 11-15 '!$C$52:$G$174,5,0),0)","v":0},67,0,null,0,10,0,0,0,48,0,8,0,1,0,null,0]
[null,94,"Kapsułki do zmywarek FAIRY Jar All in 1, 115 kapsułek","Wydajne kapsułki do maszynowego mycia naczyń Jednostka sprzedaży: 1 opakowanie (115 kapsułek) ","op. ( 115 szt)",{"$f":"IF('Załącznik 13-F.O. Zad 11-15 '!$V$55,VLOOKUP(C115,'Załącznik 13-F.O. Zad 11-15 '!$C$52:$G$174,5,0),0)","v":0},43,0,null,0,2,0,19,0,15,0,6,0,1,0,null,0]
[null,95,"Płyn do czyszczenia zmywarek FINISH, 250 ml","Płyn do czyszczenia zmywarek o zapachu cytrynowym Pojemność: 250 ml Jednostka sprzedaży 1 opakowanie","op (250 ml)",{"$f":"IF('Załącznik 13-F.O. Zad 11-15 '!$V$55,VLOOKUP(C116,'Załącznik 13-F.O. Zad 11-15 '!$C$52:$G$174,5,0),0)","v":0},22,0,null,0,2,0,13,0,6,0,null,0,1,0,null,0]
[null,96,"Płyn do mycia naczyń LUDWIK 1150 g","Posiada bardzo dobre właściwości myjące oraz wysoką zdolność do emulgowania tłuszczów zarówno w ciepłej, jak i zimnej wodzie. Nie pozostawia zacieków na umytych powierzchniach, nadaje im połysk bez konieczności wycierania do sucha. Nowa receptura została również wzbogacona kompleksem witamin A,E,F,H, mającym działanie ochronne i odżywcze dla skóry rąk, Polecany również do mycia mebli, lodówek, wykładzin, podłóg, glazury, dywanów i tworzyw sztucznych","op. (1150 g)",{"$f":"IF('Załącznik 13-F.O. Zad 11-15 '!$V$55,VLOOKUP(C117,'Załącznik 13-F.O. Zad 11-15 '!$C$52:$G$174,5,0),0)","v":0},1,0,null,0,0,0,0,0,null,0,null,0,1,0,null,0]
[null,97,"Płyn do mycia naczyń LUDWIK cytrynowy, 5 kg","Posiada bardzo dobre właściwości myjące oraz wysoką zdolność do emulgowania tłuszczów zarówno w ciepłej, jak i zimnej wodzie. Nie pozostawia zacieków na umytych powierzchniach, nadaje im połysk bez konieczności wycierania do sucha. Nowa receptura została również wzbogacona kompleksem witamin A,E,F,H, mającym działanie ochronne i odżywcze dla skóry rąk, Polecany również do mycia mebli, lodówek, wykładzin, podłóg, glazury, dywanów i tworzyw sztucznych","5 kg",{"$f":"IF('Załącznik 13-F.O. Zad 11-15 '!$V$55,VLOOKUP(C118,'Załącznik 13-F.O. Zad 11-15 '!$C$52:$G$174,5,0),0)","v":0},52,0,24,0,15,0,12,0,null,0,null,0,1,0,null,0]
[null,98,"Płyn do mycia naczyń LUDWIK Miętowy 1 l.","Posiada bardzo dobre właściwości myjące oraz wysoką zdolność do emulgowania tłuszczów zarówno w ciepłej, jak i zimnej wodzie. Nie pozostawia zacieków na umytych powierzchniach, nadaje im połysk bez konieczności wycierania do sucha. Nowa receptura została również wzbogacona kompleksem witamin A,E,F,H, mającym działanie ochronne i odżywcze dla skóry rąk, Polecany również do mycia mebli, lodówek, wykładzin, podłóg, glazury, dywanów i tworzyw sztucznych","op. (1 l)",{"$f":"IF('Załącznik 13-F.O. Zad 11-15 '!$V$55,VLOOKUP(C119,'Załącznik 13-F.O. Zad 11-15 '!$C$52:$G$174,5,0),0)","v":0},22,0,5,0,0,0,16,0,null,0,null,0,1,0,null,0]
[null,99,"Płyn do mycia naczyń LUDWIK, cytrynowy, 450 g","Posiada bardzo dobre właściwości myjące oraz wysoką zdolność do emulgowania tłuszczów zarówno w ciepłej, jak i zimnej wodzie. Nie pozostawia zacieków na umytych powierzchniach, nadaje im połysk bez konieczności wycierania do sucha. Nowa receptura została również wzbogacona kompleksem witamin A,E,F,H, mającym działanie ochronne i odżywcze dla skóry rąk, Polecany również do mycia mebli, lodówek, wykładzin, podłóg, glazury, dywanów i tworzyw sztucznych","op. (450g)",{"$f":"IF('Załącznik 13-F.O. Zad 11-15 '!$V$55,VLOOKUP(C120,'Załącznik 13-F.O. Zad 11-15 '!$C$52:$G$174,5,0),0)","v":0},248,0,8,0,56,0,40,0,10,0,133,0,1,0,null,0]
[null,100,"Płyn do naczyń LUDWIK, 450 g, miętowy"," Nie pozostawia zacieków na umytych powierzchniach, nadaje im połysk bez konieczności wycierania do sucha. Polecany również do mycia mebli, lodówek, wykładzin, podłóg, glazury, dywanów i tworzyw sztucznych.","op.(450g)",{"$f":"IF('Załącznik 13-F.O. Zad 11-15 '!$V$55,VLOOKUP(C121,'Załącznik 13-F.O. Zad 11-15 '!$C$52:$G$174,5,0),0)","v":0},205,0,11,0,42,0,11,0,7,0,133,0,1,0,null,0]
[null,101,"Płyn nabłyszczający do zmywarek LUDWIK, 750 ml","Przeznaczony do płukania i nabłyszczania naczyń zmywanych w zmywarce Dzięki właściwie dobranym składnikom i zawartości kwasku cytrynowego płyn sprawia, że myte naczynia wysychają bez plam i zacieków Jednostka sprzedaży: 1 opakowanie (750 ml)","op. (750 ml)",{"$f":"IF('Załącznik 13-F.O. Zad 11-15 '!$V$55,VLOOKUP(C122,'Załącznik 13-F.O. Zad 11-15 '!$C$52:$G$174,5,0),0)","v":0},26,0,8,0,4,0,8,0,5,0,null,0,1,0,null,0]
[null,102,"Płyn nabłyszczający FINISH, 400 ml","Usuwa ślady po kroplach wody i osad z kamienia, pozostawiając Diamentowy Połysk Jednostka sprzedaży: 1 opakowanie (400 ml)","op. (400 ml)",{"$f":"IF('Załącznik 13-F.O. Zad 11-15 '!$V$55,VLOOKUP(C123,'Załącznik 13-F.O. Zad 11-15 '!$C$52:$G$174,5,0),0)","v":0},31,0,null,0,4,0,20,0,5,0,1,0,1,0,null,0]
[null,103,"Sól ochronna do zmywarki LUDWIK, 1,5 kg","Preparat chroniący zmywarkę przed osadzaniem się kamienia w jej wnętrzu i na mytych naczyniach Skutecznie zmiękcza wodę dzięki zastosowanej formule, preparat zawiera całkowicie rozpuszczalną szlachetną sól z granulkami o odpowiedniej wielkości Regularne stosowanie soli ochronnej Ludwik zapewnia prawidłowe funkcjonowanie zmywarki i długotrwałą ochronę jej mechanizmów Jednostka sprzedaży: 1 opakowanie (1,5 kg)","op. (1 l)",{"$f":"IF('Załącznik 13-F.O. Zad 11-15 '!$V$55,VLOOKUP(C124,'Załącznik 13-F.O. Zad 11-15 '!$C$52:$G$174,5,0),0)","v":0},29,0,null,0,4,0,11,0,10,0,3,0,1,0,null,0]
[null,104,"Sól SOMAT do zmywarek, 1,5 kg","Zabezpiecza zmywarkę oraz naczynia przed osadzaniem się kamienia Wygodna w użyciu sól ma postać granulek Opakowanie: 1,5 kg Jednostka sprzedaży: 1 sztuka ","op. (5 kg)",{"$f":"IF('Załącznik 13-F.O. Zad 11-15 '!$V$55,VLOOKUP(C125,'Załącznik 13-F.O. Zad 11-15 '!$C$52:$G$174,5,0),0)","v":0},35,0,null,0,4,0,22,0,5,0,3,0,1,0,null,0]
[null,105,"Tabletki do zmywarek LUDWIK, 30 sztuk","Wielofunkcyjne tabletki czyszczą, nabłyszczają, chronią szkło i stal nierdzewną przed matowieniem oraz zabezpieczają zmywarkę przed osadzaniem się kamienia Funkcja zmiękczania wody pozwala na jeszcze bardziej efektywne wykorzystanie składników myjących Enzymy są aktywne już w 30°C Cytrusowy aromat tabletek nadaje długotrwały zapach świeżości w kuchni Zapewniają oszczędność wody i energii Jednostka sprzedaży: 1 opakowanie ( 30 tabletek)","op. (30 szt)",{"$f":"IF('Załącznik 13-F.O. Zad 11-15 '!$V$55,VLOOKUP(C126,'Załącznik 13-F.O. Zad 11-15 '!$C$52:$G$174,5,0),0)","v":0},23,0,null,0,0,0,15,0,null,0,7,0,1,0,null,0]
[null,106,"Płyn do mycia szyb i glazury LUDWIK grapefruit z octem, 750 ml","Nie pozostawia smug, zacieków i szybko odparowuje., Skład: do 5% anionowe środki powierzchniowo czynne, konserwant (2-bromo-2-nitropropane-1,3-diol, methylchloroisothiazolinone, methylisothiazolinone), kompozycja zapachowa (limonene, linalool).","op. (750ml)",{"$f":"IF('Załącznik 13-F.O. Zad 11-15 '!$V$55,VLOOKUP(C127,'Załącznik 13-F.O. Zad 11-15 '!$C$52:$G$174,5,0),0)","v":0},44,0,1,0,34,0,8,0,null,0,null,0,1,0,null,0]
[null,107,"Płyn do mycia szyb KUBUŚ z atomizerem, 1 l","Przeznaczony do mycia szyb okiennych, luster oraz innych powierzchni szklanych, Doskonale usuwa brud, nie pozostawia smug","op. (1 l)",{"$f":"IF('Załącznik 13-F.O. Zad 11-15 '!$V$55,VLOOKUP(C128,'Załącznik 13-F.O. Zad 11-15 '!$C$52:$G$174,5,0),0)","v":0},4,0,null,0,0,0,3,0,null,0,null,0,1,0,null,0]
[null,108,"Płyn do szyb i luster BUZIL G522 Profiglass, 600 ml","Gotowy do użycia środek do mycia szyb i luster Skutecznie usuwa zabrudzenia, również te tłuste\nButelka posiada specjalnie przyciętą końcówkę rozpryskującą, która ułatwia nanoszenie środka czyszczącego Wygodna butelka 600 ml ze spryskiwaczem","op (600 ml)",{"$f":"IF('Załącznik 13-F.O. Zad 11-15 '!$V$55,VLOOKUP(C129,'Załącznik 13-F.O. Zad 11-15 '!$C$52:$G$174,5,0),0)","v":0},18,0,null,0,0,0,4,0,null,0,13,0,1,0,null,0]
[null,109,"Mleczko do czyszczenia CIF Regular Cream, 650 ml/780 g","Uniwersalne mleczko CIF z mikrokryształkami, które pomaga utrzymać powierzchnie w czystości, jest delikatne i nie rysuje powierzchni. Usuwa najbardziej oporny brud taki jak: przypieczony tłuszcz, przypalone jedzenie, plamy z kamienia w łazience. Składniki: do 5% anionowe środki powierzchniowo, czynne niejonowe środki powierzchniowo czynne, mydło, kompozycja zapachowa Limonene, Benzisothiazolinone, Linalool, Butylphenyl Methylpropional, Hexyl Cinnamal. Sposób użycia: nanieść na wilgotną ściereczkę lub bezpośrednio na czyszczoną powierzchnię. Po wyczyszczeniu dokładnie spłukać. Nie połykać. Mleczko do czyszczenia powierzchni twardych.","op (650 ml)",{"$f":"IF('Załącznik 13-F.O. Zad 11-15 '!$V$55,VLOOKUP(C130,'Załącznik 13-F.O. Zad 11-15 '!$C$52:$G$174,5,0),0)","v":0},79,0,1,0,24,0,15,0,5,0,33,0,1,0,null,0]
[null,110,"Czajnik elektryczny TEFAL Express 1,5 l, biały","Czajnik z ukrytym elementem grzejnym i obrotową podstawą, Filtr antywapienny i dwustronny wskaźnik poziomu wody, Możliwość zagotowania minimalnej ilości wody (250 ml), Pojemność: 1,5 l","szt.",{"$f":"IF('Załącznik 13-F.O. Zad 11-15 '!$V$55,VLOOKUP(C131,'Załącznik 13-F.O. Zad 11-15 '!$C$52:$G$174,5,0),0)","v":0},16,0,5,0,0,0,5,0,5,0,null,0,1,0,null,0]
[null,111,"Dzbanek filtrujący wodę AQUAPHOR Onyx 4,2 l + 3 wkłady filtrujące, biały","Klasyczny i elegancki kształt pasuje do biur i sal konferencyjnych, Produkt wolny od bisfenolu A (BPA FREE), posiada atest NIZP-PZH, W zestawie 3 wkłady Maxfor MG wzbogacające wodę w magnez","op. (1 szt dzbanek + 3 szt. filtrów)",{"$f":"IF('Załącznik 13-F.O. Zad 11-15 '!$V$55,VLOOKUP(C132,'Załącznik 13-F.O. Zad 11-15 '!$C$52:$G$174,5,0),0)","v":0},67,0,18,0,0,0,45,0,3,0,null,0,1,0,null,0]
[null,112,"Filtr wody KRUPS F08801 do ekspresu ciśnieniowego, 1 sztuka","Zapobiega nadmiernemu osadzaniu się kamienia Dostosowany do ekspresów Krups Artese oraz Krups Orchestro Jednostka sprzedaży: 1 sztuka","szt",{"$f":"IF('Załącznik 13-F.O. Zad 11-15 '!$V$55,VLOOKUP(C133,'Załącznik 13-F.O. Zad 11-15 '!$C$52:$G$174,5,0),0)","v":0},22,0,13,0,0,0,8,0,null,0,null,0,1,0,null,0]
[null,113,"Termos TEFAL Campo, 1 l, czarny","Termos TEFAL Campo, 1 l, czarnyObudowa ze stali nierdzewnej z kolorową powłoką z wkładką szklaną, Kolor: czarny","szt",{"$f":"IF('Załącznik 13-F.O. Zad 11-15 '!$V$55,VLOOKUP(C134,'Załącznik 13-F.O. Zad 11-15 '!$C$52:$G$174,5,0),0)","v":0},5,0,2,0,0,0,2,0,null,0,null,0,1,0,null,0]
[null,114,"Reklamówki foliowe 9 micronów 210 + 2 x 60 x 435 mm (+/-12), 150 sztuk","Reklamówki o wymiarach 210 + 2 x 60 x 435 mm (+/-12) Nawój: 150 sztuk\nFolia HDPE / grubość 9 mikronówJednostka sprzedaży: 1 rolka (150sztuk)\n","op. (150 szt.)",{"$f":"IF('Załącznik 13-F.O. Zad 11-15 '!$V$55,VLOOKUP(C135,'Załącznik 13-F.O. Zad 11-15 '!$C$52:$G$174,5,0),0)","v":0},3,0,null,0,0,0,2,0,null,0,null,0,1,0,null,0]
[null,115,"Worki do segregacji 60 l, niebieskie na papier, 60 x 72 cm","Wytrzymałe worki ułatwiające segregację śmieci dzięki kodowi kolorystycznemu, Mają nadruk informujący, jakie typy odpadów należy do nich wrzucać, a jakich nie należy, Wymiary: 60 x 72 cm","op. (10 worków)",{"$f":"IF('Załącznik 13-F.O. Zad 11-15 '!$V$55,VLOOKUP(C136,'Załącznik 13-F.O. Zad 11-15 '!$C$52:$G$174,5,0),0)","v":0},43,0,null,0,30,0,12,0,null,0,null,0,1,0,null,0]
[null,116,"Worki do segregacji 60 l, zielone na szkło, 60 x 72 cm","Wytrzymałe worki ułatwiające segregację śmieci dzięki kodowi kolorystycznemu, Mają nadruk informujący, jakie typy odpadów należy do nich wrzucać, a jakich nie należy, Wymiary: 60 x 72 cm","op. (10 worków)",{"$f":"IF('Załącznik 13-F.O. Zad 11-15 '!$V$55,VLOOKUP(C137,'Załącznik 13-F.O. Zad 11-15 '!$C$52:$G$174,5,0),0)","v":0},31,0,null,0,30,0,0,0,null,0,null,0,1,0,null,0]
[null,117,"Worki do segregacji 60 l, zółte na plastik, 60 x 72 cm","Wytrzymałe worki ułatwiające segregację śmieci dzięki kodowi kolorystycznemu, Mają nadruk informujący, jakie typy odpadów należy do nich wrzucać, a jakich nie należy, Wymiary: 60 x 72 cm","op. (10 worków)",{"$f":"IF('Załącznik 13-F.O. Zad 11-15 '!$V$55,VLOOKUP(C138,'Załącznik 13-F.O. Zad 11-15 '!$C$52:$G$174,5,0),0)","v":0},31,0,null,0,30,0,0,0,null,0,null,0,1,0,null,0]
[null,118,"Worki na śmieci LDPE sanitarne 120 l, niebieskie, 10 sztuk","Wymiary: 110 x 70 cm, Grubość: folii: 0,03 mm","op (10 szt)",{"$f":"IF('Załącznik 13-F.O. Zad 11-15 '!$V$55,VLOOKUP(C139,'Załącznik 13-F.O. Zad 11-15 '!$C$52:$G$174,5,0),0)","v":0},53,0,16,0,30,0,0,0,null,0,6,0,1,0,null,0]
[null,119,"Worki na śmieci LDPE sanitarne 160 l, czarne, 20 sztuk","Worki na śmieci LDPE sanitarne 160 l, czarne, 20 sztuk Pojemność: 160 l Wymiary: 150 x 90 cm Grubość: folii: 0,027 mm Kolor folii: czarny Jednostka sprzedaży: 1 opakowanie (20 sztuk)","op. (20 sztuk)",{"$f":"IF('Załącznik 13-F.O. Zad 11-15 '!$V$55,VLOOKUP(C140,'Załącznik 13-F.O. Zad 11-15 '!$C$52:$G$174,5,0),0)","v":0},66,0,null,0,18,0,7,0,null,0,40,0,1,0,null,0]
[null,120,"Worki na śmieci LDPE z taśmą ściągającą 60 l, czarne, 10 sztuk","Posiadają taśmę ściągającą Pojemność: 60 l Wymiary: 72 x 60 cm Grubość: folii: 0,02 mm Kolor folii: czarny Jednostka sprzedaży: 1 opakowanie (10 sztuk)","op. (10 sztuk)",{"$f":"IF('Załącznik 13-F.O. Zad 11-15 '!$V$55,VLOOKUP(C141,'Załącznik 13-F.O. Zad 11-15 '!$C$52:$G$174,5,0),0)","v":0},146,0,null,0,100,0,0,0,null,0,40,0,1,0,5,0]
[null,121,"Worki na śmieci łazienkowe, 20 l, białe, 40 sztuk","Idealne worki na odpady łazienkowe, Pojemność: 20 l, Kolor: biały, Rozmiar: 40 x 50 cm","op: (40 sztuk)",{"$f":"IF('Załącznik 13-F.O. Zad 11-15 '!$V$55,VLOOKUP(C142,'Załącznik 13-F.O. Zad 11-15 '!$C$52:$G$174,5,0),0)","v":0},53,0,null,0,44,0,3,0,null,0,null,0,1,0,5,0]
[null,122,"Worki na śmieci MDPE 35 l, niebieskie 20 sztuk","Pojemność: 35 l Wymiary: 58 x 49 cm Grubość: folii: 0,011 mm Kolor folii: niebieski Jednostka sprzedaży: 1 opakowanie (20 sztuk)","op. (20 sztuk)",{"$f":"IF('Załącznik 13-F.O. Zad 11-15 '!$V$55,VLOOKUP(C143,'Załącznik 13-F.O. Zad 11-15 '!$C$52:$G$174,5,0),0)","v":0},70,0,8,0,15,0,6,0,null,0,40,0,1,0,null,0]
[null,null,null,null,null,null,{"$f":"SUM(G22:G143)","v":11387},null,{"$f":"SUM(I22:I143)","v":906},null,{"$f":"SUM(K22:K143)","v":5407},null,{"$f":"SUM(M22:M143)","v":1034},null,{"$f":"SUM(O22:O143)","v":2105},null,{"$f":"SUM(Q22:Q143)","v":1653},null,{"$f":"SUM(S22:S143)","v":122},null,{"$f":"SUM(U22:U143)","v":160}]
[null,null,null,null,null,null,null,null,"ŁĄCZNA CENA NETTO DLA ENEA Centrum Sp. z o.o. ",{"$f":"SUM(J22:J143)","v":0},"ŁĄCZNA CENA NETTO DLA ENEA Logistyka sp. z o.o.",{"$f":"SUM(L22:L143)","v":0},"ŁĄCZNA CENA NETTO DLA ENEA Operator sp. z.o.o.",{"$f":"SUM(N22:N143)","v":0},"ŁĄCZNA CENA NETTO DLA ENEA Oświetlenie Sp. z o.o.",{"$f":"SUM(P22:P143)","v":0},"ŁĄCZNA CENA NETTO DLA ENEA Pomiary sp. z.o.o.",{"$f":"SUM(R22:R143)","v":0},"ŁĄCZNA CENA NETTO DLA ENEA Serwis Sp. z o.o.",{"$f":"SUM(T22:T143)","v":0},"ŁĄCZNA CENA NETTO DLA ENEA S.A.",{"$f":"SUM(V22:V143)","v":0}]
[]
[]
[]
[null,null,"miejscowość i data",null,null,"Pieczęć imienna i podpis przedstawiciela(i) Wykonawcy"]

{"sheet":"Załącznik15-F.O. dla Zadania 12","index":6,"n_rows":149,"n_cols":22,"rows_kept":149,"cut":false,"hidden":false,"merged":[[2,1,2,7],[4,1,4,7],[8,1,8,7],[11,1,11,7],[14,1,14,7],[18,1,18,2],[147,2,147,3],[147,4,147,7],[148,5,148,7],[16,1,16,7]]}
[null,"Oznaczenie sprawy:  1400/DW00/ZU/KZ/2022/0000079539"]
[]
[null,"ZAŁĄCZNIK NR 15 - FORMULARZ OFERTY DLA ZADANIA 12 - DOSTAWA ARTYKUŁÓW HIGIENICZNYCH:  ZIELONA GÓRA;  GORZÓW WLKP. + WOJ. LUBUSKIE; SZCZECIN + WOJ. ZACHODNIOPOMORSKIE"]
[]
[]
[null,null,"(pieczęć wykonawcy)"]
[]
[null,"Ja, niżej podpisany (My niżej podpisani):"]
[]
[]
[null,"działając w imieniu i na rzecz:"]
[]
[]
[null,"Składam(y) ofertę na wykonanie zamówienia, którego przedmiotem jest:"]
[null,"Dostawa artykułów biurowych, spożywczych i higienicznych dla spółek GK ENEA"]
[]
[null,"ZADANIE 12 - Dostawa artykułów higienicznych:  Zielona Góra;  Gorzów Wlkp. + woj. Lubuskie; Szczecin + woj. Zachodniopomorskie"]
[]
[null,"ŁĄCZNA CENA NETTO OFERTY DLA ZADANIA 12:",null,{"$f":"SUM(H22:H143)","v":0}]
[]
[null,"LP","Nazwa produktu","Opis szczegółowy","Jednostka ","cena jednostkowa netto","Ilość","Wartość","ENEA Centrum Sp. z o.o. - Szacowana ilość","ŁĄCZNA CENA NETTO DLA ENEA Centrum Sp. z o.o. ","Enea Logistyka sp.z o.o. - Szacowana ilość","ŁĄCZNA CENA NETTO DLA Logistyka sp. z o.o.","ENEA Operator Sp. z o.o. - Szacowana ilość","ŁĄCZNA CENA NETTO DLA ENEA Operator Sp. z o.o. ","ENEA Oświetlenie Sp. z o.o. - Szacowana ilość","ŁĄCZNA CENA NETTO DLA ENEA Oświetlenie Sp. z o.o. ","ENEA Pomiary Sp. z o.o. - Szacowana ilość","ŁĄCZNA CENA NETTO DLA ENEA Pomiary Sp. z o.o. ","ENEA Serwis Sp. z o.o. - Szacowana ilość","ŁĄCZNA CENA NETTO DLA ENEA Serwis Sp. z o.o. ","ENEA S.A. - Szacowana ilość","ŁĄCZNA CENA NETTO DLA ENEA S.A."]
[null,1,"Filtr do expresu DELONGHI 45.76X","Filtr do expresu DELONGHI 45.76X","szt",{"$f":"IF('Załącznik 13-F.O. Zad 11-15 '!$V$56,VLOOKUP(C22,'Załącznik 13-F.O. Zad 11-15 '!$C$52:$G$175,5,0),0)","v":0},{"$f":"I22+K22+M22+O22+Q22+S22+U22","v":10},{"$f":"G22*F22","v":0},null,{"$f":"I22*F22","v":0},4,{"$f":"K22*F22","v":0},0,{"$f":"M22*F22","v":0},5,{"$f":"O22*F22","v":0},null,{"$f":"Q22*F22","v":0},1,{"$f":"S22*F22","v":0},null,{"$f":"U22*F22","v":0}]
[null,2,"ODKAMIENIACZ DO EKSPRESU MELITTA 250ML","odkamieniacz do  ekspresu MELITA poj. 250 ml.","szt. (250 ml)",{"$f":"IF('Załącznik 13-F.O. Zad 11-15 '!$V$56,VLOOKUP(C23,'Załącznik 13-F.O. Zad 11-15 '!$C$52:$G$175,5,0),0)","v":0},{"$f":"I23+K23+M23+O23+Q23+S23+U23","v":13},{"$f":"G23*F23","v":0},1,{"$f":"I23*F23","v":0},0,{"$f":"K23*F23","v":0},10,{"$f":"M23*F23","v":0},1,{"$f":"O23*F23","v":0},null,{"$f":"Q23*F23","v":0},1,{"$f":"S23*F23","v":0},null,{"$f":"U23*F23","v":0}]
[null,3,"Odkamieniacz KAMIX, w proszku, 150 g","Środek do usuwania osadów z kamienia Pojemność: 150 g Jednostka sprzedaży: 1 opakowanie ","op. ( 150 g)",{"$f":"IF('Załącznik 13-F.O. Zad 11-15 '!$V$56,VLOOKUP(C24,'Załącznik 13-F.O. Zad 11-15 '!$C$52:$G$175,5,0),0)","v":0},49,0,24,0,4,0,16,0,3,0,1,0,1,0,null,0]
[null,4,"Odkamieniacz uniwersalny KAMIX, w płynie, 500 ml","Środek w płynie do usuwania osadów kamienia Pojemność: 500 ml Jednostka sprzedaży: 1 opakowanie ","op. (500 ml)",{"$f":"IF('Załącznik 13-F.O. Zad 11-15 '!$V$56,VLOOKUP(C25,'Załącznik 13-F.O. Zad 11-15 '!$C$52:$G$175,5,0),0)","v":0},56,0,1,0,20,0,31,0,2,0,1,0,1,0,null,0]
[null,5,"Tabletki do czyszczenia sekcji mlecznej ekspresu","Tabletki do codziennego czyszczenia sekcji mlecznej zapewniają dokładne i higieniczne użytkowanie sekcji mlecznej Jednostka sprzedaży: 1 opakowanie","op. ( 62 szt )",{"$f":"IF('Załącznik 13-F.O. Zad 11-15 '!$V$56,VLOOKUP(C26,'Załącznik 13-F.O. Zad 11-15 '!$C$52:$G$175,5,0),0)","v":0},3,0,null,0,0,0,0,0,2,0,null,0,1,0,null,0]
[null,6,"Płyn odkamieniający DELONGHI \"EcoDecalk\"","odkamieniacz do  ekspresu DELONGHI ","szt.   ",{"$f":"IF('Załącznik 13-F.O. Zad 11-15 '!$V$56,VLOOKUP(C27,'Załącznik 13-F.O. Zad 11-15 '!$C$52:$G$175,5,0),0)","v":0},10,0,null,0,6,0,3,0,0,0,null,0,1,0,null,0]
[null,7,"Tabletki czyszczące KRUPS XS3000, 10 sztuk","Tabletki czyszczące przeznaczone do ekspresów ciśnieniowych i przelewowych Usuwają tłuszcz i pozostałości po kawie wewnątrz ekspresu. Regularne stosowanie gwarantuje utrzymanie wysokiej jakości kawy Jednostka sprzedaży: 1 opakowanie (10 sztuk)","op (10 szt)",{"$f":"IF('Załącznik 13-F.O. Zad 11-15 '!$V$56,VLOOKUP(C28,'Załącznik 13-F.O. Zad 11-15 '!$C$52:$G$175,5,0),0)","v":0},26,0,null,0,0,0,14,0,7,0,4,0,1,0,null,0]
[null,8,"Tabletki do zmywarek FINISH All-in-1, 50 tabletek","Jego unikalna formuła łączy w sobie działanie 10 funkcji Power Actions: usuwanie zaplamień, usuwanie tłuszczu, namaczanie, usuwanie zabrudzeń po herbacie, kryształowy połyski, lśniące sztućce, ochrona przed osadzaniem się kamienia w zmywarce, aktywna ochrona szkła, ochrona srebra, usuwanie opornych zabrudzeń, Dodatkowo spełnia funkcje soli i płynu nabłyszczającego, Składniki: 5 - 15 % związki wybielające na bazie tlenu, niejonowe środki powierzchniowo czynne, do 5 % polikarboksylany, fosfoniany. Enzymy (subtylizyna, amylaza), kompozycja zapachowa.","op (50 szt)",{"$f":"IF('Załącznik 13-F.O. Zad 11-15 '!$V$56,VLOOKUP(C29,'Załącznik 13-F.O. Zad 11-15 '!$C$52:$G$175,5,0),0)","v":0},64,0,16,0,0,0,30,0,13,0,4,0,1,0,null,0]
[null,9,"UNIWERSALNY zestaw do odkamieniania ekspresów","Uniwerslany zestaw do odkamieniania ekspresów Nespresso. Ilość sztuk w opakowaniu: 2 Jednostka sprzedaży: 1 opakowanie","op",{"$f":"IF('Załącznik 13-F.O. Zad 11-15 '!$V$56,VLOOKUP(C30,'Załącznik 13-F.O. Zad 11-15 '!$C$52:$G$175,5,0),0)","v":0},18,0,2,0,0,0,7,0,8,0,null,0,1,0,null,0]
[null,10,"Wkłady filtrujące BRITA Maxtra+ Pure Performance, 3 sztuki","Wybierając wkłady filtrujące Brita Maxtra+ Pure Performance, zapewniasz sobie czystą wodę o doskonałym smaku. Zastosowane perełki węgla aktywnego skutecznie zatrzymują chlor i redukują mogące występować w wodzie zanieczyszczenia, jak herbicydy, pestycydy czy pozostałości po farmaceutykach. Z kolei perełki wymiennika jonowego zmiękczają wodę i zmniejszają występowanie metali w rodzaju miedzi i ołowiu. Wkłady filtrując są rekomendowane do wody miękkiej i średnio twardej.","op (3 szt)",{"$f":"IF('Załącznik 13-F.O. Zad 11-15 '!$V$56,VLOOKUP(C31,'Załącznik 13-F.O. Zad 11-15 '!$C$52:$G$175,5,0),0)","v":0},42,0,null,0,4,0,29,0,8,0,null,0,1,0,null,0]
[null,11,"Worki papierowe do odkurzacza MERIDA Dex, 3 sztuki","Worki papierowe do odkurzacza MERIDA Dex, 3 sztuki","op (3 szt)",{"$f":"IF('Załącznik 13-F.O. Zad 11-15 '!$V$56,VLOOKUP(C32,'Załącznik 13-F.O. Zad 11-15 '!$C$52:$G$175,5,0),0)","v":0},1,0,null,0,0,0,0,0,0,0,null,0,1,0,null,0]
[null,12,"Wymienne wkłady do filtra wody AQUAPHOR MAXFOR","Największa na rynku wydajność - do 200 l, Zawiera innowacyjne włókno Aqualen, dzięki czemu skutecznie usuwa z wody chlor, metale ciężkie, fenol, pestycydy i inne zanieczyszczenia, Redukuje twardość wody i zapobiega pojawianiu się osadu i kamienia na urządzeniach AGD np. w czajnikach i ekspresach, Produkt wolny od bisfenolu A (BPA FREE), wykonany z ekologicznych materiałów","op (3 szt)",{"$f":"IF('Załącznik 13-F.O. Zad 11-15 '!$V$56,VLOOKUP(C33,'Załącznik 13-F.O. Zad 11-15 '!$C$52:$G$175,5,0),0)","v":0},44,0,11,0,0,0,30,0,0,0,2,0,1,0,null,0]
[null,13,"Zestaw do odkamieniania KRUPS F054, 2 saszetki po 40 g","Zestaw polecany do ekspresów KRUPS Informacje na temat sposobu użytkowania dostępne w instrukcji obsługi ekspresu W opakowaniu: 2 saszetki środka odkamieniającego Jednostka sprzedaży: 1 opakowanie (2 saszetki x 40 g)","op (2 saszetki)",{"$f":"IF('Załącznik 13-F.O. Zad 11-15 '!$V$56,VLOOKUP(C34,'Załącznik 13-F.O. Zad 11-15 '!$C$52:$G$175,5,0),0)","v":0},6,0,null,0,0,0,0,0,5,0,null,0,1,0,null,0]
[null,14,"Apteczka VERA TOP 15 PLUS, DIN 13157, w walizce z ABS","Apteczka w walizce z tworzywa ABS. Zawiera stelaż mocujący do ściany W skład wyposażenia wchodzą: kompres zimny – 1 szt., kompres na oko – 2 szt., kompres 10 x 10 cm - 3 opakowania (po 2 sztuki) opaska elastyczna 4 m x 6 cm – 2 szt., opaska elastyczna 4 m x 8 cm – 2 szt., zestaw plastrów 10 x 6 cm (8 szt.) – 1 komplet, zestaw plastrów (14 szt.) – 1 komplet, plaster 5 m x 2,5 cm – 1 szt., opatrunek indywidualny M sterylny – 3 szt. opatrunek indywidualny G sterylny – 1 szt., opatrunek indywidualny K sterylny – 1 szt., chusta opatrunkowa 60 x 80 cm – 1 szt. chusta trójkątna – 1 szt., chusta z flizeliny (5 szt.) – 1 komplet, koc ratunkowy 160 x 210 cm – 1 szt. nożyczki 19 cm – 1 szt., rękawice winylowe – 4 szt. chusteczka dezynfekująca – 6 sztuk, ustnik do sztucznego oddychania – 1 szt., instrukcja udzielania pierwszej pomocy Skład zgodny z normą DIN 13157. Rozmiar: 330 x 235 x 125 mm Jednostka sprzedaży: 1 sztuka","szt",{"$f":"IF('Załącznik 13-F.O. Zad 11-15 '!$V$56,VLOOKUP(C35,'Załącznik 13-F.O. Zad 11-15 '!$C$52:$G$175,5,0),0)","v":0},22,0,7,0,1,0,6,0,6,0,1,0,1,0,null,0]
[null,15,"Wyposażenie apteczki DIN 13157 PLUS","Czajnik posiada filtr antywapienny, który zapobiega przedostawaniu się kamienia do szklanki, Pojemność: 1,7 l Moc: 2400 W","op",{"$f":"IF('Załącznik 13-F.O. Zad 11-15 '!$V$56,VLOOKUP(C36,'Załącznik 13-F.O. Zad 11-15 '!$C$52:$G$175,5,0),0)","v":0},32,0,10,0,9,0,1,0,10,0,1,0,1,0,null,0]
[null,16,"Chusteczki KATRIN Plus, 100 sztuk","Białe, dwuwarstwowe chusteczki higieniczne w praktycznym podajniku Testowane dermatologicznie Jednostka sprzedaży: 1 opakowanie (100 sztuk) ","op (100 szt)",{"$f":"IF('Załącznik 13-F.O. Zad 11-15 '!$V$56,VLOOKUP(C37,'Załącznik 13-F.O. Zad 11-15 '!$C$52:$G$175,5,0),0)","v":0},229,0,200,0,0,0,1,0,20,0,7,0,1,0,null,0]
[null,17,"Czajnik elektryczny TEFAL Express 1,5 l, biały","Filtr antywapienny i dwustronny wskaźnik poziomu wody, Możliwość zagotowania minimalnej ilości wody (250 ml), Pojemność: 1,5 l, Moc: 2400 W","szt",{"$f":"IF('Załącznik 13-F.O. Zad 11-15 '!$V$56,VLOOKUP(C38,'Załącznik 13-F.O. Zad 11-15 '!$C$52:$G$175,5,0),0)","v":0},43,0,13,0,1,0,27,0,0,0,1,0,1,0,null,0]
[null,18,"Czajnik elektryczny TEFAL Loft, 1,7 l, czarny","Zdejmowana pokrywa ułatwia napełnianie wodą, Czajnik posiada filtr antywapienny, który zapobiega przedostawaniu się kamienia do szklanki, Pojemność: 1,7 l, Moc: 2400 W","szt",{"$f":"IF('Załącznik 13-F.O. Zad 11-15 '!$V$56,VLOOKUP(C39,'Załącznik 13-F.O. Zad 11-15 '!$C$52:$G$175,5,0),0)","v":0},52,0,13,0,1,0,32,0,4,0,1,0,1,0,null,0]
[null,19,"Czyściwo włókninowe, wielozadaniowe do trudnych zabrudzeń TORK, 1 rolka","Jednowarstwowe, grube i mocne czyściwo wielozadaniowe non-woven (syntetyczno-celulozowe) Duża chłonność, także oleistych substancji Niskopylne i odporne na rozerwania Współpracuje z rozpuszczalnikami, ograniczając ich zużycie Polecane do stosowania w przemyśle maszynowym, poligraficznym, spożywczym  nawet do najcięższych zadań związanych z czyszczeniem Atest PZH i certyfikat ISEGA, zezwalający na stosowanie produktu w przemyśle spożywczym W wygodnym kartonie mogącym służyć jako dozownik Perforacja co 38 cm Materiał: włóknina jednowarstwowa Tłoczenie: nie Ilość listków: 280  szerokość listka: 320 mm Długość roli: 106,4 m  średnica r[...]","szt",{"$f":"IF('Załącznik 13-F.O. Zad 11-15 '!$V$56,VLOOKUP(C40,'Załącznik 13-F.O. Zad 11-15 '!$C$52:$G$175,5,0),0)","v":0},2,0,null,0,0,0,1,0,0,0,null,0,1,0,null,0]
[null,20,"Kij z mopem sznurkowym, 1 komplet","Kij z mopem sznurkowym, Waga: 345 g, Jednostka sprzedaży: 1 sztuka","szt",{"$f":"IF('Załącznik 13-F.O. Zad 11-15 '!$V$56,VLOOKUP(C41,'Załącznik 13-F.O. Zad 11-15 '!$C$52:$G$175,5,0),0)","v":0},12,0,3,0,2,0,4,0,2,0,null,0,1,0,null,0]
[null,21,"Nakładka CEG z mikrofibry na mop triple, długość 40 cm","Mop trójskładnikowy DUO (kieszeń + klips), Wykonany z bawełny, mikrowłókna i poliestru, Długość: 40 cm","szt",{"$f":"IF('Załącznik 13-F.O. Zad 11-15 '!$V$56,VLOOKUP(C42,'Załącznik 13-F.O. Zad 11-15 '!$C$52:$G$175,5,0),0)","v":0},3,0,null,0,0,0,2,0,0,0,null,0,1,0,null,0]
[null,22,"Ściereczki gąbczaste niebieskie, 3 sztuki","Bardzo trwałe i chłonne ścierki gąbczaste, wzmocnione wewnętrzną bawełnianą siatką, Najlepsze do wycierania wody, zmywania powierzchni i usuwania brudu","op. (3 szt)",{"$f":"IF('Załącznik 13-F.O. Zad 11-15 '!$V$56,VLOOKUP(C43,'Załącznik 13-F.O. Zad 11-15 '!$C$52:$G$175,5,0),0)","v":0},83,0,52,0,13,0,5,0,12,0,null,0,1,0,null,0]
[null,23,"Ścierka do podłogi, 50 x 60 cm, pomarańczowa","Ścierka do podłogi, 50 x 60 cm, pomarańczowaWymiary: 50 x 60 cm, Do czyszczenia dużych powierzchni","szt",{"$f":"IF('Załącznik 13-F.O. Zad 11-15 '!$V$56,VLOOKUP(C44,'Załącznik 13-F.O. Zad 11-15 '!$C$52:$G$175,5,0),0)","v":0},6,0,null,0,2,0,3,0,0,0,null,0,1,0,null,0]
[null,24,"Ścierka z mikrofibry KOLORADO, 35 x 35 cm","Ścierka z mikrofibry przeznaczona do czyszczenia powierzchni szklanych i stosowania w łazience, Skuteczna na sucho i mokro, Nie pozostawia smug, zacieków ani kłaczków, Skład: 80% poliester, 20% poliamid (nylon)","szt",{"$f":"IF('Załącznik 13-F.O. Zad 11-15 '!$V$56,VLOOKUP(C45,'Załącznik 13-F.O. Zad 11-15 '!$C$52:$G$175,5,0),0)","v":0},30,0,null,0,4,0,12,0,6,0,7,0,1,0,null,0]
[null,25,"Ścierki uniwersalne Practi Maxi 50sztuk","Ścierki uniwersalne Practi Maxi 50sztuk rozmiar 25 x 40","op (50 szt)",{"$f":"IF('Załącznik 13-F.O. Zad 11-15 '!$V$56,VLOOKUP(C46,'Załącznik 13-F.O. Zad 11-15 '!$C$52:$G$175,5,0),0)","v":0},3,0,null,0,0,0,2,0,0,0,null,0,1,0,null,0]
[null,26,"Ścierki uniwersalne, 5 sztuk","Ścierki wielokrotnego użytku Można je prać i sterylizować Wykonane z wiskozy, pachnące Miks kolorów Wymiary: 37 x 38 cm","op (5 szt)",{"$f":"IF('Załącznik 13-F.O. Zad 11-15 '!$V$56,VLOOKUP(C47,'Załącznik 13-F.O. Zad 11-15 '!$C$52:$G$175,5,0),0)","v":0},20,0,null,0,10,0,9,0,0,0,null,0,1,0,null,0]
[null,27,"Proszek do prania tkanin kolorowych DOSIA, 300 g","Proszek do prania tkanin kolorowych do wszystkich typów pralek i do prania ręcznego\nZawiera enzymy i aktywne składniki piorące\nNie zawiera chlorowych wybielaczy: jest delikatna dla kolorowych i ciemnych tkanin\nJednostka sprzedaży: 1 sztuka (300 g)","op (300g)",{"$f":"IF('Załącznik 13-F.O. Zad 11-15 '!$V$56,VLOOKUP(C48,'Załącznik 13-F.O. Zad 11-15 '!$C$52:$G$175,5,0),0)","v":0},64,0,null,0,48,0,1,0,0,0,14,0,1,0,null,0]
[null,28,"Proszek do prania tkanin PUROX, 5 kg","Do wszystkich typów pralek i do prania ręcznego, Jednostka sprzedaży: 1 opakowanie (5 kg), Składniki: do 5% anionowe i niejonowe środki powierzchniowo czynne, enzymy, kompozycja zapachowa, krzemiany, niejonowe środki powierzchniowo, czynne, regulatory piany, rozjaśniacze optyczne, związki wybielające na bazie tlenu","op (5 kg)",{"$f":"IF('Załącznik 13-F.O. Zad 11-15 '!$V$56,VLOOKUP(C49,'Załącznik 13-F.O. Zad 11-15 '!$C$52:$G$175,5,0),0)","v":0},8,0,null,0,0,0,0,0,0,0,7,0,1,0,null,0]
[null,29,"Chusteczki FELLOWES do czyszczenia ekranów, opakowanie 100szt","Chusteczki FELLOWES do czyszczenia ekranów, opakowanie 100szt","op (100 szt)",{"$f":"IF('Załącznik 13-F.O. Zad 11-15 '!$V$56,VLOOKUP(C50,'Załącznik 13-F.O. Zad 11-15 '!$C$52:$G$175,5,0),0)","v":0},41,0,10,0,10,0,11,0,2,0,null,0,1,0,7,0]
[null,30,"Płyn AJAX Floral Fiesta, 1 l","Doskonale usuwa kurz i brud, pozostawiając na długo świeży zapach Miks zapachów Pojemność: 1 l Jednostka sprzedaży 1 sztuka","op (1l)",{"$f":"IF('Załącznik 13-F.O. Zad 11-15 '!$V$56,VLOOKUP(C51,'Załącznik 13-F.O. Zad 11-15 '!$C$52:$G$175,5,0),0)","v":0},19,0,null,0,12,0,6,0,0,0,null,0,1,0,null,0]
[null,31,"Preparat do usuwania tłustego brudu VOIGT C457 Ultra Clean plus 1 l","Odtłuszczanie, gruntowne mycie bez fosforanów – Produkt do profesjonalnego zastosowania, Nie zawierający fosforanów, Usuwa zabrudzenia pochodzenia tłuszczowego i przemysłowego m.in. oleje, smary. Zalecany do: warsztatów, hal produkcyjnych, galerii handlowych, centrów logistycznych","op (1l)",{"$f":"IF('Załącznik 13-F.O. Zad 11-15 '!$V$56,VLOOKUP(C52,'Załącznik 13-F.O. Zad 11-15 '!$C$52:$G$175,5,0),0)","v":0},1,0,null,0,0,0,0,0,0,0,null,0,1,0,null,0]
[null,32,"Rozpuszczalnik do etykiet w sprayu, pojemność 200 ml","Produkt zapewnia w pełni bezpieczne usunięcie etykiet z dowolnej powierzchni, nie pozostawiając żadnych, śladów kleju. Pojemność 200 ml.","op (200 ml)",{"$f":"IF('Załącznik 13-F.O. Zad 11-15 '!$V$56,VLOOKUP(C53,'Załącznik 13-F.O. Zad 11-15 '!$C$52:$G$175,5,0),0)","v":0},12,0,1,0,4,0,6,0,0,0,null,0,1,0,null,0]
[null,33,"Gąbka do zmywania różowa, 5 sztuk","Gąbka do różnorodnych zastosowań, Kolor: różowy","op (5 szt)",{"$f":"IF('Załącznik 13-F.O. Zad 11-15 '!$V$56,VLOOKUP(C54,'Załącznik 13-F.O. Zad 11-15 '!$C$52:$G$175,5,0),0)","v":0},26,0,null,0,3,0,7,0,5,0,null,0,1,0,10,0]
[null,34,"Gąbki do zmywania standardowa, 5 sztuk","Do zmywania naczyń, szkła, ceramiki, powierzchni emaliowanych Wytrzymała Miks kolorów w opakowaniu Jednostka sprzedaży: 1 opakowanie (5 sztuk) Opakowanie zbiorcze: 18 opakowań","op (5 szt)",{"$f":"IF('Załącznik 13-F.O. Zad 11-15 '!$V$56,VLOOKUP(C55,'Załącznik 13-F.O. Zad 11-15 '!$C$52:$G$175,5,0),0)","v":0},284,0,132,0,2,0,31,0,1,0,107,0,1,0,10,0]
[null,35,"Kuchenka mikrofalowa SEVERIN 7890/7862, biała","5 poziomów mocy, Rozmrażanie w oparciu o czas i wagę, 35-minutowy timer z sygnałem akustycznym, Pokrętło regulacyjne z chromowanymi elementami, Średnica wyjmowanego talerza ok. 25,4 cm, Wysokość komory ok. 16,5 cm, Obudowa i komora lakierowana powłoką odporną na wysokie temperatur, Wymiary: szer. 43,5, gł. 34,5, wys. 25,4 cm, Moc: 700 W","szt",{"$f":"IF('Załącznik 13-F.O. Zad 11-15 '!$V$56,VLOOKUP(C56,'Załącznik 13-F.O. Zad 11-15 '!$C$52:$G$175,5,0),0)","v":0},6,0,null,0,2,0,3,0,0,0,null,0,1,0,null,0]
[null,36,"Jednorazowa maska higieniczna 3-warstwowa, niebieska, 50 sztuk","Trójwarstwowa maska higieniczna. Wykonana z włókniny polipropylenowej (100%). Materiał: Texfil 25 (Spunbond) + Texfil 25 (Spunbond) + Texfil 25 (Spunbond). Gramatura: 25 gsm + 25 gsm + 25 gsm= 75 gsm. Gumki – długość 16cm - 18cm (± 1cm).","op (50szt)",{"$f":"IF('Załącznik 13-F.O. Zad 11-15 '!$V$56,VLOOKUP(C57,'Załącznik 13-F.O. Zad 11-15 '!$C$52:$G$175,5,0),0)","v":0},137,0,85,0,0,0,11,0,40,0,null,0,1,0,null,0]
[null,37,"Półmaska FILTERSERVICE FS-623V NR D, FFP2, z zaworem, 10 sztuk","Czasza półmaski: - Igłowana włóknina poliestrowa,  - Włóknina polipropylenowa typu melt blown, - Włóknina osłonowa, - Zawór wydechowy, - Zapinki taśm nagłowia, - Taśma nagłowia","op (10szt)",{"$f":"IF('Załącznik 13-F.O. Zad 11-15 '!$V$56,VLOOKUP(C58,'Załącznik 13-F.O. Zad 11-15 '!$C$52:$G$175,5,0),0)","v":0},1,0,null,0,0,0,0,0,0,0,null,0,1,0,null,0]
[null,38,"Nawilżacz powietrza NU 5N","4 poziomy intensywności nawilżania, Automatyczna kontrola wilgotności, Demontowany zasobnik wody 5,2 l, Funkcja jonizacji","szt",{"$f":"IF('Załącznik 13-F.O. Zad 11-15 '!$V$56,VLOOKUP(C59,'Załącznik 13-F.O. Zad 11-15 '!$C$52:$G$175,5,0),0)","v":0},8,0,4,0,0,0,3,0,0,0,null,0,1,0,null,0]
[null,39,"Odświeżacz powietrza AMBI PUR, zapach kwiatowy, 300 ml","Wypełnia pomieszczenie zapachem najpiękniejszego wiosennego bukietu Pojemność: 300 ml Jednostka sprzedaży: 1 sztuka Opakowanie zbiorcze: 6 sztuk","szt",{"$f":"IF('Załącznik 13-F.O. Zad 11-15 '!$V$56,VLOOKUP(C60,'Załącznik 13-F.O. Zad 11-15 '!$C$52:$G$175,5,0),0)","v":0},20,0,null,0,5,0,8,0,6,0,null,0,1,0,null,0]
[null,40,"Odświeżacz powietrza BRISE w sprayu","Odświeżając pomieszczenia pozostawia przyjemny zapach Pojemność: 300 ml Jednostka sprzedaży: 1 sztuka ","szt.",{"$f":"IF('Załącznik 13-F.O. Zad 11-15 '!$V$56,VLOOKUP(C61,'Załącznik 13-F.O. Zad 11-15 '!$C$52:$G$175,5,0),0)","v":0},31,0,5,0,0,0,0,0,5,0,20,0,1,0,null,0]
[null,41,"Odświeżacz powietrza BRISE w żelu, miks zapachów","Masa netto: 150 g Miks zapachów Jednostka sprzedaży: 1 sztuka ","szt.",{"$f":"IF('Załącznik 13-F.O. Zad 11-15 '!$V$56,VLOOKUP(C62,'Załącznik 13-F.O. Zad 11-15 '!$C$52:$G$175,5,0),0)","v":0},24,0,2,0,12,0,2,0,0,0,7,0,1,0,null,0]
[null,42,"Odświeżacz powietrza GREEN FRESH, 400 ml","Skutecznie neutralizuje i pochłania nieprzyjemne zapachy\nOdświeża i nawilża powietrze, pozostawiając w pomieszczeniu uczucie świeżości i czystości Pojemność: 400 ml Jednostka sprzedaży: 1 sztuka","op. (400 ml)",{"$f":"IF('Załącznik 13-F.O. Zad 11-15 '!$V$56,VLOOKUP(C63,'Załącznik 13-F.O. Zad 11-15 '!$C$52:$G$175,5,0),0)","v":0},4,0,null,0,0,0,3,0,0,0,null,0,1,0,null,0]
[null,43,"Patyczki zapachowe PACHNĄCA SZAFA, Słoneczne popołudnie, 50 ml","Patyczki zapachowe PACHNĄCA SZAFA nadają przyjemny i odświeżający zapach w każdym pomieszczeniu. Odświeżać ma bardzo ładną formę eleganckich patyczków w szklanym flakoniku.","op (50 ml)",{"$f":"IF('Załącznik 13-F.O. Zad 11-15 '!$V$56,VLOOKUP(C64,'Załącznik 13-F.O. Zad 11-15 '!$C$52:$G$175,5,0),0)","v":0},8,0,null,0,0,0,7,0,0,0,null,0,1,0,null,0]
[null,44,"Wkład do odświeżacza AMBI PUR, zapach ocean and wind","Wkład do elektrycznego odświeżacza powietrza AMBI PUR (6.630.347) Wydajność wkładów: do 80 dni Jednostka sprzedaży: 1 sztuka ","szt",{"$f":"IF('Załącznik 13-F.O. Zad 11-15 '!$V$56,VLOOKUP(C65,'Załącznik 13-F.O. Zad 11-15 '!$C$52:$G$175,5,0),0)","v":0},16,0,null,0,6,0,3,0,6,0,null,0,1,0,null,0]
[null,45,"Papier toaletowy CLASSIC, biały, 8 rolek","Papier toaletowy CLASSIC, biały, 8 rolek Wymiary listka: szer. 100 x dł. 112 mm, Szerokość taśmy: 100 mm","op. (8 rolek)",{"$f":"IF('Załącznik 13-F.O. Zad 11-15 '!$V$56,VLOOKUP(C66,'Załącznik 13-F.O. Zad 11-15 '!$C$52:$G$175,5,0),0)","v":0},89,0,null,0,80,0,8,0,0,0,null,0,1,0,null,0]
[null,46,"Papier toaletowy ELLIS PROFESSIONAL JUMBO 130/2, 12 rolek","Papier do użytku profesjonalnego w pomieszczeniach o zwiększonym natężeniu użytkowania, Materiał: celuloza dwuwarstwowa, Gramatura: 2 x 16 g/m², Długość roli: 120 m; średnica roli: 19 cm; średnica gilzy: 6 cm","op (12 rolek)",{"$f":"IF('Załącznik 13-F.O. Zad 11-15 '!$V$56,VLOOKUP(C67,'Załącznik 13-F.O. Zad 11-15 '!$C$52:$G$175,5,0),0)","v":0},11,0,null,0,10,0,0,0,0,0,null,0,1,0,null,0]
[null,47,"Papier toaletowy KATRIN 11296 PLUS 160, biały, 8 rolek","Papier toaletowy KATRIN 11296 PLUS 160, biały, 8 rolek Gramatura: 2 x 16,5 g/m², Długość jednej rolki: 18,3 m","op. (8 rolek)",{"$f":"IF('Załącznik 13-F.O. Zad 11-15 '!$V$56,VLOOKUP(C68,'Załącznik 13-F.O. Zad 11-15 '!$C$52:$G$175,5,0),0)","v":0},1,0,null,0,0,0,0,0,0,0,null,0,1,0,null,0]
[null,48,"Supermocny Plaster do cięcia VISCOPLAST, 1 m x 8 cm","Opatrunek włókninowy o wysokiej chłonności, Plaster natychmiast przykleja się do skóry, nawet do wilgotnej, Ogranicza przywieranie opatrunku do rany","op (1m)",{"$f":"IF('Załącznik 13-F.O. Zad 11-15 '!$V$56,VLOOKUP(C69,'Załącznik 13-F.O. Zad 11-15 '!$C$52:$G$175,5,0),0)","v":0},11,0,5,0,4,0,1,0,0,0,null,0,1,0,null,0]
[null,49,"Uniwersalny zestaw plastrów 3M VISCOPLAST, 24 sztuki","Plastry z opatrunkiem do opatrywania drobnych ran i skaleczeń Hypoalergiczne i wodoodporne Przepuszczające powietrze W opakowaniu 24 plastry: plastry Minifol: 72 x 25 mm - 4 sztuki, 72 x 19 mm - 8 sztuk, 57 x 16 mm - 6 sztuk, 38x10 mm - 4 sztuki Plaster Prestopor 10 x 6 cm Plaster Prestovis Plus 10 x 6 cm Jednostka sprzedaży: 1 opakowanie","op. ( 24 szt)",{"$f":"IF('Załącznik 13-F.O. Zad 11-15 '!$V$56,VLOOKUP(C70,'Załącznik 13-F.O. Zad 11-15 '!$C$52:$G$175,5,0),0)","v":0},20,0,1,0,10,0,3,0,5,0,null,0,1,0,null,0]
[null,50,"Krem do rąk EVELINE ''Niewidzialne rękawiczki'', 100 ml","Odżywczo-ochronny krem do rąk z formułą witaminową Polecany do suchych i podrażnionych dłoni Pojemność: 100 ml Jednostka sprzedaży: 1 sztuka ","op do (100 ml)",{"$f":"IF('Załącznik 13-F.O. Zad 11-15 '!$V$56,VLOOKUP(C71,'Załącznik 13-F.O. Zad 11-15 '!$C$52:$G$175,5,0),0)","v":0},91,0,null,0,90,0,0,0,0,0,null,0,1,0,null,0]
[null,51,"Krem do rąk GARNIER do skóry bardzo suchej, 100 g","Regeneruje i odżywia zniszczoną skórę dłoni Zawiera alantoinę, glicerynę oraz czynnik filtrującyJednostka sprzedaży: 1 sztuka (100 g)","op. (100 g)",{"$f":"IF('Załącznik 13-F.O. Zad 11-15 '!$V$56,VLOOKUP(C72,'Załącznik 13-F.O. Zad 11-15 '!$C$52:$G$175,5,0),0)","v":0},747,0,null,0,216,0,0,0,528,0,2,0,1,0,null,0]
[null,52,"Ręcznik MALFINI, chabrowy, 70x140 cm","Tkana metka, która może również służyć jako wieszaczek, Ozdobiony wyszywaną bordiurą po obu brzegach, Sklad: 100% bawełna, frotte, Gramatura: 450g/m², Kolor: chabrowy, Rozmiar: 70x140 cm","szt",{"$f":"IF('Załącznik 13-F.O. Zad 11-15 '!$V$56,VLOOKUP(C73,'Załącznik 13-F.O. Zad 11-15 '!$C$52:$G$175,5,0),0)","v":0},155,0,null,0,23,0,1,0,106,0,24,0,1,0,null,0]
[null,53,"Ręcznik MALFINI, granatowy, 50x100 cm","Tkana metka, która może również służyć jako wieszaczek, Ozdobiony wyszywaną bordiurą po obu brzegach, Sklad: 100% bawełna, frotte, Gramatura: 450g/m², Kolor: granatowy","szt",{"$f":"IF('Załącznik 13-F.O. Zad 11-15 '!$V$56,VLOOKUP(C74,'Załącznik 13-F.O. Zad 11-15 '!$C$52:$G$175,5,0),0)","v":0},22,0,null,0,21,0,0,0,0,0,null,0,1,0,null,0]
[null,54,"Ręcznik MALFINI, szaro-czarny, 50x100 cm","Wykonane z wysokiej jakości frotte, odpowiednie pod haft, Miękkie, miłe w dotyku, dobrze absorbują wodę, Tkana metka, która może również służyć jako wieszaczek, Ozdobiony wyszywaną bordiurą po obu brzegach, Sklad: 100% bawełna, frotte, Gramatura: 450g/m² kolor szaroczany ","szt",{"$f":"IF('Załącznik 13-F.O. Zad 11-15 '!$V$56,VLOOKUP(C75,'Załącznik 13-F.O. Zad 11-15 '!$C$52:$G$175,5,0),0)","v":0},22,0,null,0,21,0,0,0,0,0,null,0,1,0,null,0]
[null,55,"Ręcznik MALFINI, szaro-czarny, 70x140 cm","Tkana metka, która może również służyć jako wieszaczek, Ozdobiony wyszywaną bordiurą po obu brzegach, Sklad: 100% bawełna, frotte, Gramatura: 450g/m², Kolor: szaroczarny Rozmiar: 70x140 cm","szt",{"$f":"IF('Załącznik 13-F.O. Zad 11-15 '!$V$56,VLOOKUP(C76,'Załącznik 13-F.O. Zad 11-15 '!$C$52:$G$175,5,0),0)","v":0},26,0,null,0,5,0,0,0,0,0,20,0,1,0,null,0]
[null,56,"Chusteczki higieniczne VELVET, 120 sztuk","Chusteczki higieniczne VELVET, 120 sztuk. W opakowaniu 120 sztuk, Produkt ma atest PZH, ","op (120 szt)",{"$f":"IF('Załącznik 13-F.O. Zad 11-15 '!$V$56,VLOOKUP(C77,'Załącznik 13-F.O. Zad 11-15 '!$C$52:$G$175,5,0),0)","v":0},24,0,1,0,0,0,11,0,10,0,1,0,1,0,null,0]
[null,57,"Ręcznik w roli ESTIMO 100/2, 500 listków","Wytrzymały, dwuwarstwowy ręcznik w 100% wykonany z celulozy o wysokich parametrach i pięknym designie Długość rolki: 100 m W rolce 500 odcinków o wymiarach: 20,3 x 20 cm Kolor biały Jednostka sprzedaży: 1 rolka ","op. (rolka 100 m)",{"$f":"IF('Załącznik 13-F.O. Zad 11-15 '!$V$56,VLOOKUP(C78,'Załącznik 13-F.O. Zad 11-15 '!$C$52:$G$175,5,0),0)","v":0},14,0,null,0,0,0,13,0,0,0,null,0,1,0,null,0]
[null,58,"Ręczniki papierowe białe, składka V, 20 x 200 listków","Gofrowane ręczniki w składce Kompatybilne ze standardowymi dozownikami do ręczników typu ZZ Materiał: makulatura jednowarstwowa Wymiary listka: 25 x 23 cm Gramatura: 1 x 30 g/m² Ilość bind w opakowaniu: 20 Ilość listków w bindzie: 200 Kolor: biały Jednostka sprzedaży: 1 karton (4000 listków)","op. (20 x 200 listków)",{"$f":"IF('Załącznik 13-F.O. Zad 11-15 '!$V$56,VLOOKUP(C79,'Załącznik 13-F.O. Zad 11-15 '!$C$52:$G$175,5,0),0)","v":0},51,0,34,0,12,0,4,0,0,0,null,0,1,0,null,0]
[null,59,"Ręczniki papierowe MERIDA składka V, 20 x 160 listków","Gofrowane ręczniki w składce wysokiej chłonności Kompatybilne ze standardowymi dozownikami do ręczników typu ZZ Materiał: makulatura dwuwarstwowa Wymiary listka: 25 x 23 cm Gramatura:2 x 19 g/m² Tłoczenie: nie Ilość bind w opakowaniu: 20 Ilość listków w bindzie: 160 Kolor: biały Jednostka sprzedaży: 1 karton (3200 listków)","op. (20 x 160 listków)",{"$f":"IF('Załącznik 13-F.O. Zad 11-15 '!$V$56,VLOOKUP(C80,'Załącznik 13-F.O. Zad 11-15 '!$C$52:$G$175,5,0),0)","v":0},9,0,null,0,6,0,2,0,0,0,null,0,1,0,null,0]
[null,60,"Ręczniki papierowe zielone, składka V, 20 x 200 listków","Gofrowane ręczniki w składce wysokiej chłonności Kompatybilne ze standardowymi dozownikami do ręczników typu ZZ Materiał: makulatura jednowarstwowa Wymiary listka: 25 x 23 cm Gramatura:2 x 19 g/m² Tłoczenie: nie Ilość bind w opakowaniu: 20 Ilość listków w bindzie: 160 Kolor: zielon. ","op. (20 x 200 listków)",{"$f":"IF('Załącznik 13-F.O. Zad 11-15 '!$V$56,VLOOKUP(C81,'Załącznik 13-F.O. Zad 11-15 '!$C$52:$G$175,5,0),0)","v":0},1,0,null,0,0,0,0,0,0,0,null,0,1,0,null,0]
[null,61,"Ręczniki w roli TORK UNIVERSAL Extra Długie do systemu TORK Matic H1, 6 rolek","Materiał: makulatura jednowarstwowa, Tłoczenie: nie, Ilość listków:1120, Długość roli: 280 m; wysokość roli: 21 cm; średnica roli: 19 cm; średnica gilzy: 3,8 cm","op. (6 rolek)",{"$f":"IF('Załącznik 13-F.O. Zad 11-15 '!$V$56,VLOOKUP(C82,'Załącznik 13-F.O. Zad 11-15 '!$C$52:$G$175,5,0),0)","v":0},55,0,54,0,0,0,0,0,0,0,null,0,1,0,null,0]
[null,62,"Rękawice antystatyczne ANSELL HyFlex® 11-800, rozmiar 9, para","Nylonowe rękawice z powłoką z pianki nitrylowej, wykonane w technologii KnitZonz™ Wszechstronne rozwiązanie do precyzyjnego montażu i prac ogólnych Zaawansowana technologia dziania zapewnia większą rozciągliwość i elastyczność w miejscach o zwiększonym nacisku Antystatyczne, zgodne z normą EN 1149 Norma EN 388 3131 (EN 388:2016 3131A) Rozmiar: 9 Jednostka sprzedaży: 1 para ","op. (1 para)",{"$f":"IF('Załącznik 13-F.O. Zad 11-15 '!$V$56,VLOOKUP(C83,'Załącznik 13-F.O. Zad 11-15 '!$C$52:$G$175,5,0),0)","v":0},6,0,null,0,0,0,0,0,0,0,5,0,1,0,null,0]
[null,63,"Rękawice DELTAPLUS VV835 Chemsafe, rozmiar 11, para","Rękawica z podwójną powłoką nitrylową na wkładzie z poliamidu, Trzecia powłoka z szorstkiej pianki nitrylowej na stronie chwytnej i końcach palców, Długość: 35 cm, Grubość: 1,15 mm - 1,30 mm na stronie chwytnej","op, 1 (para)",{"$f":"IF('Załącznik 13-F.O. Zad 11-15 '!$V$56,VLOOKUP(C84,'Załącznik 13-F.O. Zad 11-15 '!$C$52:$G$175,5,0),0)","v":0},1,0,null,0,0,0,0,0,0,0,null,0,1,0,null,0]
[null,64,"Rękawice nitrylowe MEDASEPT PF, czarne, rozmiar S, 100 sztuk","Uniwersalne, rękawice pasujące na prawą i lewą dłoń, Nitrylowe, Tekstura na końcach palców, Rozmiar S","op. (100 szt)",{"$f":"IF('Załącznik 13-F.O. Zad 11-15 '!$V$56,VLOOKUP(C85,'Załącznik 13-F.O. Zad 11-15 '!$C$52:$G$175,5,0),0)","v":0},54,0,20,0,0,0,6,0,0,0,27,0,1,0,null,0]
[null,65,"Rękawice nitrylowe MEDASEPT PREMIER, niebieskie, rozmiar XL, 100 sztuk","Rękawice nitrylowe diagnostyczne i ochronne (kat. III), Bezpudrowe., Uniwersalny kształt pasuje na obie dłonie, Tekstura na końcach palców, Przeznaczone do kontaktu z żywnością.","op. (100 szt)",{"$f":"IF('Załącznik 13-F.O. Zad 11-15 '!$V$56,VLOOKUP(C86,'Załącznik 13-F.O. Zad 11-15 '!$C$52:$G$175,5,0),0)","v":0},33,0,5,0,0,0,0,0,0,0,27,0,1,0,null,0]
[null,66,"Rękawice nitrylowe MEDASEPT PRIME, niebieskie, rozmiar L, 100 sztuk","Rękawice nitrylowe diagnostyczne i ochronne, Bezpudrowe. Uniwersalny kształt pasuje na obie dłonie. ","op. (100 szt)",{"$f":"IF('Załącznik 13-F.O. Zad 11-15 '!$V$56,VLOOKUP(C87,'Załącznik 13-F.O. Zad 11-15 '!$C$52:$G$175,5,0),0)","v":0},{"$f":"I87+K87+M87+O87+Q87+S87+U87","v":68},{"$f":"G87*F87","v":0},20,{"$f":"I87*F87","v":0},0,{"$f":"K87*F87","v":0},0,{"$f":"M87*F87","v":0},20,{"$f":"O87*F87","v":0},27,{"$f":"Q87*F87","v":0},1,{"$f":"S87*F87","v":0},null,{"$f":"U87*F87","v":0}]
[null,67,"Rękawice nitrylowe MEDASEPT PRIME, niebieskie, rozmiar M, 100 sztuk","Rękawice nitrylowe diagnostyczne i ochronne","op. (100 szt)",{"$f":"IF('Załącznik 13-F.O. Zad 11-15 '!$V$56,VLOOKUP(C88,'Załącznik 13-F.O. Zad 11-15 '!$C$52:$G$175,5,0),0)","v":0},118,0,67,0,3,0,0,0,20,0,27,0,1,0,null,0]
[null,68,"Ręcznik kuchenny VELVET Jumbo, 1 rolka","Dwuwarstwowy ręcznik papierowy, który świetnie nadaje się do generalnych porządków, prac w garażu, ogrodzie oraz w kuchni Giga rola = 13 standardowych rolek Nie tylko chłonny i wytrzymały, ale także wyjątkowo wydajny Jedna rolka zawiera aż 520 listków Wysokość rolki: 22 cm Kolor biały Jednostka sprzedaży: 1 rolka ","szt ( 1 rolka)",{"$f":"IF('Załącznik 13-F.O. Zad 11-15 '!$V$56,VLOOKUP(C89,'Załącznik 13-F.O. Zad 11-15 '!$C$52:$G$175,5,0),0)","v":0},11,0,null,0,0,0,5,0,5,0,null,0,1,0,null,0]
[null,69,"Ręcznik papierowy BRATEK biały, 2 rolki","Ręczniki kuchenne, dwuwarstwowe, celulozowe Szerokość rolki: 22 cm Długość rolki: 11 m Jednostka sprzedaży: 1 opakowanie (2 sztuki)","op (2 rolki)",{"$f":"IF('Załącznik 13-F.O. Zad 11-15 '!$V$56,VLOOKUP(C90,'Załącznik 13-F.O. Zad 11-15 '!$C$52:$G$175,5,0),0)","v":0},15,0,13,0,0,0,1,0,0,0,null,0,1,0,null,0]
[null,70,"Ręczniki kuchenne AHA, 2 rolki","Dwuwarstwowy ręcznik wykonany z czystej celulozy W rolce 50 odcinków o wymiarach: 23 x 20 cm W opakowaniu: 2 rolki Kolor biały Jednostka sprzedaży: 1 opakowanie ","op (2 rolki)",{"$f":"IF('Załącznik 13-F.O. Zad 11-15 '!$V$56,VLOOKUP(C91,'Załącznik 13-F.O. Zad 11-15 '!$C$52:$G$175,5,0),0)","v":0},16,0,null,0,6,0,5,0,0,0,4,0,1,0,null,0]
[null,71,"Ręczniki kuchenne VELVET, 2 rolki","Produkt wolny od bisfenolu A (BPA FREE), posiada atest NIZP-PZH","op. (2 rolki)",{"$f":"IF('Załącznik 13-F.O. Zad 11-15 '!$V$56,VLOOKUP(C92,'Załącznik 13-F.O. Zad 11-15 '!$C$52:$G$175,5,0),0)","v":0},132,0,null,0,100,0,19,0,0,0,12,0,1,0,null,0]
[null,72,"Łyżeczki do herbaty AMEFA Bologna, 12 sztuk","subtelne i eleganckie łyżeczki do herbaty, Sztućce polerowane, stal 18/0","op (12 szt)",{"$f":"IF('Załącznik 13-F.O. Zad 11-15 '!$V$56,VLOOKUP(C93,'Załącznik 13-F.O. Zad 11-15 '!$C$52:$G$175,5,0),0)","v":0},11,0,null,0,1,0,9,0,0,0,null,0,1,0,null,0]
[null,73,"Łyżeczki do kawy AMEFA Bologna, 12 sztuk","Klasyczne, proste w formie, subtelne i eleganckie łyżeczki do kawy Dobra jakość w atrakcyjnej cenie powodują, iż linia od lat cieszy się wyjątkową popularnością  Sztućce polerowane, stal 18/0","op (12 szt)",{"$f":"IF('Załącznik 13-F.O. Zad 11-15 '!$V$56,VLOOKUP(C94,'Załącznik 13-F.O. Zad 11-15 '!$C$52:$G$175,5,0),0)","v":0},4,0,null,0,1,0,2,0,0,0,null,0,1,0,null,0]
[null,74,"Łyżki AMEFA Bologna, 12 sztuk","Sztućce polerowane, stal 18/0","op (12 szt)",{"$f":"IF('Załącznik 13-F.O. Zad 11-15 '!$V$56,VLOOKUP(C95,'Załącznik 13-F.O. Zad 11-15 '!$C$52:$G$175,5,0),0)","v":0},6,0,null,0,1,0,4,0,0,0,null,0,1,0,null,0]
[null,75,"Widelce AMEFA Bologna, 12 sztuk","\nSztućce polerowane, stal 18/0, ","op (12 szt)",{"$f":"IF('Załącznik 13-F.O. Zad 11-15 '!$V$56,VLOOKUP(C96,'Załącznik 13-F.O. Zad 11-15 '!$C$52:$G$175,5,0),0)","v":0},5,0,null,0,1,0,3,0,0,0,null,0,1,0,null,0]
[null,76,"Ściereczki mokre do mebli drewnianych PRESTO, opakowanie 72 sztuki","Ściereczki nawilżane do czyszczenia różnych powierzchni, Usuwają kurz i zapobiegają jego osadzaniu, Nadają połysk czyszczonym powierzchniom","op. (72 szt)",{"$f":"IF('Załącznik 13-F.O. Zad 11-15 '!$V$56,VLOOKUP(C97,'Załącznik 13-F.O. Zad 11-15 '!$C$52:$G$175,5,0),0)","v":0},15,0,null,0,0,0,10,0,4,0,null,0,1,0,null,0]
[null,77,"Kulki do toalet BREF Power Activ, 50 g, zapach cytrynowy","Nowoczesne rozwiązanie w postaci czterech kulek na wygodnej zawieszce Czyszczą, pozostawiają przyjemny zapach i chronią przed osadzaniem się kamienia Masa netto: 50 g Jednostka sprzedaży: 1 sztuka Opakowanie zbiorcze: 10 sztuk","op. (50 g)",{"$f":"IF('Załącznik 13-F.O. Zad 11-15 '!$V$56,VLOOKUP(C98,'Załącznik 13-F.O. Zad 11-15 '!$C$52:$G$175,5,0),0)","v":0},91,0,null,0,3,0,3,0,0,0,84,0,1,0,null,0]
[null,78,"Kulki do toalet BREF Power Activ, 50 g, zapach morski","Nowoczesne rozwiązanie w postaci czterech kulek na wygodnej zawieszce Czyszczą, pozostawiają przyjemny zapach i chronią przed osadzaniem się kamienia Masa netto: 50 g Jednostka sprzedaży: 1 sztuka ","op. (50 g)",{"$f":"IF('Załącznik 13-F.O. Zad 11-15 '!$V$56,VLOOKUP(C99,'Załącznik 13-F.O. Zad 11-15 '!$C$52:$G$175,5,0),0)","v":0},80,0,null,0,23,0,4,0,18,0,34,0,1,0,null,0]
[null,79,"Płyn CILIT Bang Kamień i brud, 750 ml","Żel CILIT kamień i brud z Turbo Power. Do czyszczenia wanien, kabin prysznicowych, płytek, toalet, armatury kuchennej i łazienkowej Usuwa kamień, rdzawe zacieki z twardej wody, osad z mydła i inne zabrudzenia Pojemność: 750 ml Jednostka sprzedaży: 1 sztuka","op. (750 ml)",{"$f":"IF('Załącznik 13-F.O. Zad 11-15 '!$V$56,VLOOKUP(C100,'Załącznik 13-F.O. Zad 11-15 '!$C$52:$G$175,5,0),0)","v":0},22,0,null,0,6,0,8,0,0,0,7,0,1,0,null,0]
[null,80,"Płyn do toalet DOMESTOS Toilet Limescale Remover, 750 ml","Gęsty płyn do czyszczenia muszli klozetowych Formuła ściśle przylegająca do czyszczonych powierzchni, rozpuszcza kamień wapienny Przeznaczony do powierzchni porcelanowych i szkliwionych Butelka z wygodnym dozownikiem Pojemność: 750 ml Jednostka sprzedaży: 1 sztuka Opakowanie zbiorcze: 6 sztuk","op. (750 ml)",{"$f":"IF('Załącznik 13-F.O. Zad 11-15 '!$V$56,VLOOKUP(C101,'Załącznik 13-F.O. Zad 11-15 '!$C$52:$G$175,5,0),0)","v":0},42,0,null,0,6,0,1,0,0,0,34,0,1,0,null,0]
[null,81,"Płyn do WC DOMESTOS 24H, 1,25 l, cytrynowy","Produkt czyszcząco-dezynfekująco-wybielający Możliwość stosowania do: muszli klozetowych, umywalek, zlewów itp. Produkt nadaje się także do wybielania tkanin Jednostka sprzedaży: 1 sztuka Pojemność: 1,25 l ","op. (1,25 l)",{"$f":"IF('Załącznik 13-F.O. Zad 11-15 '!$V$56,VLOOKUP(C102,'Załącznik 13-F.O. Zad 11-15 '!$C$52:$G$175,5,0),0)","v":0},59,0,null,0,20,0,4,0,0,0,34,0,1,0,null,0]
[null,82,"Płyn do WC DOMESTOS 24H, 1,25 l, leśny","Produkt czyszcząco-dezynfekująco-wybielający Możliwość stosowania do: muszli klozetowych, umywalek, zlewów itp. Produkt nadaje się także do wybielania tkanin Pojemność: 1,25 l Jednostka sprzedaży: 1 sztuka ","op. (1,25 l)",{"$f":"IF('Załącznik 13-F.O. Zad 11-15 '!$V$56,VLOOKUP(C103,'Załącznik 13-F.O. Zad 11-15 '!$C$52:$G$175,5,0),0)","v":0},1,0,null,0,0,0,0,0,0,0,null,0,1,0,null,0]
[null,83,"Wkład zapachowy do pisuarów MERIDA, czerwony","Winylowy, elastyczny wkład zapachowy do pisuarów, Zapach utrzymuje się przez około 30 dni, Dodatkowo wkład zabezpiecza pisuar przed zapchaniem","szt.",{"$f":"IF('Załącznik 13-F.O. Zad 11-15 '!$V$56,VLOOKUP(C104,'Załącznik 13-F.O. Zad 11-15 '!$C$52:$G$175,5,0),0)","v":0},10,0,null,0,6,0,2,0,0,0,null,0,1,0,1,0]
[null,84,"Zawieszka do WC DOMESTOS, zapach leśny","Zawieszki czyszczące do toalet Chronią przed osadzaniem się kamienia i pozostawiają świeży zapach Jednostka sprzedaży 1 sztuka ","szt",{"$f":"IF('Załącznik 13-F.O. Zad 11-15 '!$V$56,VLOOKUP(C105,'Załącznik 13-F.O. Zad 11-15 '!$C$52:$G$175,5,0),0)","v":0},11,0,null,0,0,0,10,0,0,0,null,0,1,0,null,0]
[null,85,"Żel BREF do WC Fresh Mist, 700 ml","Usuwa kamień, brud i osad, Gęsta formuła żelu sprawia, że działa on również pod powierzchnią wody.","op. (700 ml)",{"$f":"IF('Załącznik 13-F.O. Zad 11-15 '!$V$56,VLOOKUP(C106,'Załącznik 13-F.O. Zad 11-15 '!$C$52:$G$175,5,0),0)","v":0},12,0,null,0,0,0,1,0,6,0,4,0,1,0,null,0]
[null,86,"Żel CLINEX Drill do udrażniania odpływów, 1 l","Szybko rozpuszcza wszelkie stałe i organiczne zanieczyszczenia takie jak: tłuszcz, papier, wata, odpadki kuchenne, Forma żelowa pozwala na osadzanie się preparatu na ściankach rur, przedłużając proces działania, Likwiduje nieprzyjemne zapachy, Nadaje się do udrażniania rur zarówno w kuchni, jak i w łazience","op. (1 l)",{"$f":"IF('Załącznik 13-F.O. Zad 11-15 '!$V$56,VLOOKUP(C107,'Załącznik 13-F.O. Zad 11-15 '!$C$52:$G$175,5,0),0)","v":0},13,0,null,0,7,0,3,0,0,0,2,0,1,0,null,0]
[null,87,"Biobójczy płyn do dezynfekcji rąk HISKIN, 1 l","Produkt przeznaczony do codziennego stosowania przez użytkownika powszechnego. Wykazuje działanie bakteriobójcze, grzybobójcze i wirusobójcze","op. (1 l)",{"$f":"IF('Załącznik 13-F.O. Zad 11-15 '!$V$56,VLOOKUP(C108,'Załącznik 13-F.O. Zad 11-15 '!$C$52:$G$175,5,0),0)","v":0},54,0,16,0,0,0,2,0,0,0,34,0,1,0,1,0]
[null,88,"Dozownik do mydła w płynie MERIDA TOP, biały","Mocny i trwały dozownik do mydła w płynie wykonany z tworzywa ABS Okienko umożliwiające kontrolę zużycia mydła Pojemność: 0,8 l Zestaw do montażu w komplecie Wymiary: dł. 11,5 x szer.11,5 x wys. 25 cm Kolor: biały Jednostka sprzedaży: 1 sztuka","szt.",{"$f":"IF('Załącznik 13-F.O. Zad 11-15 '!$V$56,VLOOKUP(C109,'Załącznik 13-F.O. Zad 11-15 '!$C$52:$G$175,5,0),0)","v":0},9,0,null,0,2,0,4,0,2,0,null,0,1,0,null,0]
[null,89,"Mydło toaletowe NIVEA, 100 g","Kremowe mydło z odżywczym olejkiem migdałowym Miks zapachów Jednostka sprzedaży: 1 sztuka ","szt. (100 g)",{"$f":"IF('Załącznik 13-F.O. Zad 11-15 '!$V$56,VLOOKUP(C110,'Załącznik 13-F.O. Zad 11-15 '!$C$52:$G$175,5,0),0)","v":0},2003,0,null,0,552,0,1,0,1449,0,null,0,1,0,null,0]
[null,90,"Mydło w płynie MERIDA Silva, 5 l","Mydło w płynie typu „dwa w jednym”, Zawiera m.in. glukopony mające doskonałe właściwości pielęgnacyjne skóry, jak również gluadyny – roślinne proteiny, szczególnie cenne składniki pielęgnacyjne chroniące skórę i włosy","op. (5l)",{"$f":"IF('Załącznik 13-F.O. Zad 11-15 '!$V$56,VLOOKUP(C111,'Załącznik 13-F.O. Zad 11-15 '!$C$52:$G$175,5,0),0)","v":0},8,0,null,0,1,0,6,0,0,0,null,0,1,0,null,0]
[null,91,"Mydło w płynie PALMOLIVE, migdałowe, 300 ml","Dzięki naturalnemu pH nie podrażnia nawet wrażliwej skóry Zawiera kombinację substancji czyszczących i odżywczych Opakowanie z dozownikiem Pojemność 300 ml Jednostka sprzedaży: 1 sztuka Opakowanie zbiorcze: 12 sztuk","op. (300 ml)",{"$f":"IF('Załącznik 13-F.O. Zad 11-15 '!$V$56,VLOOKUP(C112,'Załącznik 13-F.O. Zad 11-15 '!$C$52:$G$175,5,0),0)","v":0},165,0,null,0,144,0,18,0,0,0,2,0,1,0,null,0]
[null,92,"Pasta BHP do rąk, ścierna, 500 g","Usuwa silne zabrudzenia smarami, tłuszczami, sadzami","op. (500g)",{"$f":"IF('Załącznik 13-F.O. Zad 11-15 '!$V$56,VLOOKUP(C113,'Załącznik 13-F.O. Zad 11-15 '!$C$52:$G$175,5,0),0)","v":0},147,0,null,0,4,0,0,0,135,0,7,0,1,0,null,0]
[null,93,"Pasta do rąk MERIDA PA12, 500 ml","Usuwa wszelkie zabrudzenia nawet powstałe od smarów i olejów, Oszczędna w użyciu, Jest niealkaliczna i nie zawiera mineralnych środków ściernych","op. (500 ml)",{"$f":"IF('Załącznik 13-F.O. Zad 11-15 '!$V$56,VLOOKUP(C114,'Załącznik 13-F.O. Zad 11-15 '!$C$52:$G$175,5,0),0)","v":0},15,0,null,0,10,0,0,0,0,0,4,0,1,0,null,0]
[null,94,"Kapsułki do zmywarek FAIRY Jar All in 1, 115 kapsułek","Wydajne kapsułki do maszynowego mycia naczyń Jednostka sprzedaży: 1 opakowanie (115 kapsułek) ","op. ( 115 szt)",{"$f":"IF('Załącznik 13-F.O. Zad 11-15 '!$V$56,VLOOKUP(C115,'Załącznik 13-F.O. Zad 11-15 '!$C$52:$G$175,5,0),0)","v":0},24,0,5,0,0,0,14,0,0,0,4,0,1,0,null,0]
[null,95,"Płyn do czyszczenia zmywarek FINISH, 250 ml","Płyn do czyszczenia zmywarek o zapachu cytrynowym Pojemność: 250 ml Jednostka sprzedaży 1 opakowanie","op (250 ml)",{"$f":"IF('Załącznik 13-F.O. Zad 11-15 '!$V$56,VLOOKUP(C116,'Załącznik 13-F.O. Zad 11-15 '!$C$52:$G$175,5,0),0)","v":0},47,0,36,0,0,0,10,0,0,0,null,0,1,0,null,0]
[null,96,"Płyn do mycia naczyń LUDWIK 1150 g","Posiada bardzo dobre właściwości myjące oraz wysoką zdolność do emulgowania tłuszczów zarówno w ciepłej, jak i zimnej wodzie. Nie pozostawia zacieków na umytych powierzchniach, nadaje im połysk bez konieczności wycierania do sucha. Nowa receptura została również wzbogacona kompleksem witamin A,E,F,H, mającym działanie ochronne i odżywcze dla skóry rąk, Polecany również do mycia mebli, lodówek, wykładzin, podłóg, glazury, dywanów i tworzyw sztucznych","op. (1150 g)",{"$f":"IF('Załącznik 13-F.O. Zad 11-15 '!$V$56,VLOOKUP(C117,'Załącznik 13-F.O. Zad 11-15 '!$C$52:$G$175,5,0),0)","v":0},1,0,null,0,0,0,0,0,0,0,null,0,1,0,null,0]
[null,97,"Płyn do mycia naczyń LUDWIK cytrynowy, 5 kg","Posiada bardzo dobre właściwości myjące oraz wysoką zdolność do emulgowania tłuszczów zarówno w ciepłej, jak i zimnej wodzie. Nie pozostawia zacieków na umytych powierzchniach, nadaje im połysk bez konieczności wycierania do sucha. Nowa receptura została również wzbogacona kompleksem witamin A,E,F,H, mającym działanie ochronne i odżywcze dla skóry rąk, Polecany również do mycia mebli, lodówek, wykładzin, podłóg, glazury, dywanów i tworzyw sztucznych","5 kg",{"$f":"IF('Załącznik 13-F.O. Zad 11-15 '!$V$56,VLOOKUP(C118,'Załącznik 13-F.O. Zad 11-15 '!$C$52:$G$175,5,0),0)","v":0},15,0,1,0,4,0,9,0,0,0,null,0,1,0,null,0]
[null,98,"Płyn do mycia naczyń LUDWIK Miętowy 1 l.","Posiada bardzo dobre właściwości myjące oraz wysoką zdolność do emulgowania tłuszczów zarówno w ciepłej, jak i zimnej wodzie. Nie pozostawia zacieków na umytych powierzchniach, nadaje im połysk bez konieczności wycierania do sucha. Nowa receptura została również wzbogacona kompleksem witamin A,E,F,H, mającym działanie ochronne i odżywcze dla skóry rąk, Polecany również do mycia mebli, lodówek, wykładzin, podłóg, glazury, dywanów i tworzyw sztucznych","op. (1 l)",{"$f":"IF('Załącznik 13-F.O. Zad 11-15 '!$V$56,VLOOKUP(C119,'Załącznik 13-F.O. Zad 11-15 '!$C$52:$G$175,5,0),0)","v":0},25,0,null,0,10,0,13,0,1,0,null,0,1,0,null,0]
[null,99,"Płyn do mycia naczyń LUDWIK, cytrynowy, 450 g","Posiada bardzo dobre właściwości myjące oraz wysoką zdolność do emulgowania tłuszczów zarówno w ciepłej, jak i zimnej wodzie. Nie pozostawia zacieków na umytych powierzchniach, nadaje im połysk bez konieczności wycierania do sucha. Nowa receptura została również wzbogacona kompleksem witamin A,E,F,H, mającym działanie ochronne i odżywcze dla skóry rąk, Polecany również do mycia mebli, lodówek, wykładzin, podłóg, glazury, dywanów i tworzyw sztucznych","op. (450g)",{"$f":"IF('Załącznik 13-F.O. Zad 11-15 '!$V$56,VLOOKUP(C120,'Załącznik 13-F.O. Zad 11-15 '!$C$52:$G$175,5,0),0)","v":0},145,0,24,0,10,0,31,0,12,0,67,0,1,0,null,0]
[null,100,"Płyn do naczyń LUDWIK, 450 g, miętowy"," Nie pozostawia zacieków na umytych powierzchniach, nadaje im połysk bez konieczności wycierania do sucha. Polecany również do mycia mebli, lodówek, wykładzin, podłóg, glazury, dywanów i tworzyw sztucznych.","op.(450g)",{"$f":"IF('Załącznik 13-F.O. Zad 11-15 '!$V$56,VLOOKUP(C121,'Załącznik 13-F.O. Zad 11-15 '!$C$52:$G$175,5,0),0)","v":0},95,0,10,0,3,0,8,0,0,0,67,0,1,0,6,0]
[null,101,"Płyn nabłyszczający do zmywarek LUDWIK, 750 ml","Przeznaczony do płukania i nabłyszczania naczyń zmywanych w zmywarce Dzięki właściwie dobranym składnikom i zawartości kwasku cytrynowego płyn sprawia, że myte naczynia wysychają bez plam i zacieków Jednostka sprzedaży: 1 opakowanie (750 ml)","op. (750 ml)",{"$f":"IF('Załącznik 13-F.O. Zad 11-15 '!$V$56,VLOOKUP(C122,'Załącznik 13-F.O. Zad 11-15 '!$C$52:$G$175,5,0),0)","v":0},8,0,null,0,0,0,7,0,0,0,null,0,1,0,null,0]
[null,102,"Płyn nabłyszczający FINISH, 400 ml","Usuwa ślady po kroplach wody i osad z kamienia, pozostawiając Diamentowy Połysk Jednostka sprzedaży: 1 opakowanie (400 ml)","op. (400 ml)",{"$f":"IF('Załącznik 13-F.O. Zad 11-15 '!$V$56,VLOOKUP(C123,'Załącznik 13-F.O. Zad 11-15 '!$C$52:$G$175,5,0),0)","v":0},28,0,11,0,0,0,15,0,1,0,null,0,1,0,null,0]
[null,103,"Sól ochronna do zmywarki LUDWIK, 1,5 kg","Preparat chroniący zmywarkę przed osadzaniem się kamienia w jej wnętrzu i na mytych naczyniach Skutecznie zmiękcza wodę dzięki zastosowanej formule, preparat zawiera całkowicie rozpuszczalną szlachetną sól z granulkami o odpowiedniej wielkości Regularne stosowanie soli ochronnej Ludwik zapewnia prawidłowe funkcjonowanie zmywarki i długotrwałą ochronę jej mechanizmów Jednostka sprzedaży: 1 opakowanie (1,5 kg)","op. (1 l)",{"$f":"IF('Załącznik 13-F.O. Zad 11-15 '!$V$56,VLOOKUP(C124,'Załącznik 13-F.O. Zad 11-15 '!$C$52:$G$175,5,0),0)","v":0},19,0,8,0,0,0,8,0,0,0,2,0,1,0,null,0]
[null,104,"Sól SOMAT do zmywarek, 1,5 kg","Zabezpiecza zmywarkę oraz naczynia przed osadzaniem się kamienia Wygodna w użyciu sól ma postać granulek Opakowanie: 1,5 kg Jednostka sprzedaży: 1 sztuka ","op. (5 kg)",{"$f":"IF('Załącznik 13-F.O. Zad 11-15 '!$V$56,VLOOKUP(C125,'Załącznik 13-F.O. Zad 11-15 '!$C$52:$G$175,5,0),0)","v":0},20,0,null,0,0,0,17,0,0,0,2,0,1,0,null,0]
[null,105,"Tabletki do zmywarek LUDWIK, 30 sztuk","Wielofunkcyjne tabletki czyszczą, nabłyszczają, chronią szkło i stal nierdzewną przed matowieniem oraz zabezpieczają zmywarkę przed osadzaniem się kamienia Funkcja zmiękczania wody pozwala na jeszcze bardziej efektywne wykorzystanie składników myjących Enzymy są aktywne już w 30°C Cytrusowy aromat tabletek nadaje długotrwały zapach świeżości w kuchni Zapewniają oszczędność wody i energii Jednostka sprzedaży: 1 opakowanie (30 tabletek)","op. (30 szt)",{"$f":"IF('Załącznik 13-F.O. Zad 11-15 '!$V$56,VLOOKUP(C126,'Załącznik 13-F.O. Zad 11-15 '!$C$52:$G$175,5,0),0)","v":0},23,0,null,0,0,0,12,0,6,0,4,0,1,0,null,0]
[null,106,"Płyn do mycia szyb i glazury LUDWIK grapefruit z octem, 750 ml","Nie pozostawia smug, zacieków i szybko odparowuje., Skład: do 5% anionowe środki powierzchniowo czynne, konserwant (2-bromo-2-nitropropane-1,3-diol, methylchloroisothiazolinone, methylisothiazolinone), kompozycja zapachowa (limonene, linalool).","op. (750ml)",{"$f":"IF('Załącznik 13-F.O. Zad 11-15 '!$V$56,VLOOKUP(C127,'Załącznik 13-F.O. Zad 11-15 '!$C$52:$G$175,5,0),0)","v":0},32,0,1,0,23,0,7,0,0,0,null,0,1,0,null,0]
[null,107,"Płyn do mycia szyb KUBUŚ z atomizerem, 1 l","Przeznaczony do mycia szyb okiennych, luster oraz innych powierzchni szklanych, Doskonale usuwa brud, nie pozostawia smug","op. (1 l)",{"$f":"IF('Załącznik 13-F.O. Zad 11-15 '!$V$56,VLOOKUP(C128,'Załącznik 13-F.O. Zad 11-15 '!$C$52:$G$175,5,0),0)","v":0},3,0,null,0,0,0,2,0,0,0,null,0,1,0,null,0]
[null,108,"Płyn do szyb i luster BUZIL G522 Profiglass, 600 ml","Gotowy do użycia środek do mycia szyb i luster Skutecznie usuwa zabrudzenia, również te tłuste\nButelka posiada specjalnie przyciętą końcówkę rozpryskującą, która ułatwia nanoszenie środka czyszczącego Wygodna butelka 600 ml ze spryskiwaczem","op (600 ml)",{"$f":"IF('Załącznik 13-F.O. Zad 11-15 '!$V$56,VLOOKUP(C129,'Załącznik 13-F.O. Zad 11-15 '!$C$52:$G$175,5,0),0)","v":0},11,0,null,0,0,0,3,0,0,0,7,0,1,0,null,0]
[null,109,"Mleczko do czyszczenia CIF Regular Cream, 650 ml/780 g","Uniwersalne mleczko CIF z mikrokryształkami, które pomaga utrzymać powierzchnie w czystości, jest delikatne i nie rysuje powierzchni. Usuwa najbardziej oporny brud taki jak: przypieczony tłuszcz, przypalone jedzenie, plamy z kamienia w łazience. Składniki: do 5% anionowe środki powierzchniowo, czynne niejonowe środki powierzchniowo czynne, mydło, kompozycja zapachowa Limonene, Benzisothiazolinone, Linalool, Butylphenyl Methylpropional, Hexyl Cinnamal. Sposób użycia: nanieść na wilgotną ściereczkę lub bezpośrednio na czyszczoną powierzchnię. Po wyczyszczeniu dokładnie spłukać. Nie połykać. Mleczko do czyszczenia powierzchni twardych.","op (650 ml)",{"$f":"IF('Załącznik 13-F.O. Zad 11-15 '!$V$56,VLOOKUP(C130,'Załącznik 13-F.O. Zad 11-15 '!$C$52:$G$175,5,0),0)","v":0},45,0,1,0,14,0,12,0,0,0,17,0,1,0,null,0]
[null,110,"Czajnik elektryczny TEFAL Express 1,5 l, biały","Czajnik z ukrytym elementem grzejnym i obrotową podstawą, Filtr antywapienny i dwustronny wskaźnik poziomu wody, Możliwość zagotowania minimalnej ilości wody (250 ml), Pojemność: 1,5 l","szt.",{"$f":"IF('Załącznik 13-F.O. Zad 11-15 '!$V$56,VLOOKUP(C131,'Załącznik 13-F.O. Zad 11-15 '!$C$52:$G$175,5,0),0)","v":0},11,0,5,0,1,0,4,0,0,0,null,0,1,0,null,0]
[null,111,"Dzbanek filtrujący wodę AQUAPHOR Onyx 4,2 l + 3 wkłady filtrujące, biały","Klasyczny i elegancki kształt pasuje do biur i sal konferencyjnych, Produkt wolny od bisfenolu A (BPA FREE), posiada atest NIZP-PZH, W zestawie 3 wkłady Maxfor MG wzbogacające wodę w magnez","op. (1 szt dzbanek + 3 szt. filtrów)",{"$f":"IF('Załącznik 13-F.O. Zad 11-15 '!$V$56,VLOOKUP(C132,'Załącznik 13-F.O. Zad 11-15 '!$C$52:$G$175,5,0),0)","v":0},36,0,1,0,0,0,34,0,0,0,null,0,1,0,null,0]
[null,112,"Filtr wody KRUPS F08801 do ekspresu ciśnieniowego, 1 sztuka","Zapobiega nadmiernemu osadzaniu się kamienia Dostosowany do ekspresów Krups Artese oraz Krups Orchestro Jednostka sprzedaży: 1 sztuka","szt",{"$f":"IF('Załącznik 13-F.O. Zad 11-15 '!$V$56,VLOOKUP(C133,'Załącznik 13-F.O. Zad 11-15 '!$C$52:$G$175,5,0),0)","v":0},11,0,null,0,0,0,7,0,3,0,null,0,1,0,null,0]
[null,113,"Termos TEFAL Campo, 1 l, czarny","Termos TEFAL Campo, 1 l, czarnyObudowa ze stali nierdzewnej z kolorową powłoką z wkładką szklaną, Kolor: czarny","szt",{"$f":"IF('Załącznik 13-F.O. Zad 11-15 '!$V$56,VLOOKUP(C134,'Załącznik 13-F.O. Zad 11-15 '!$C$52:$G$175,5,0),0)","v":0},4,0,null,0,0,0,1,0,2,0,null,0,1,0,null,0]
[null,114,"Reklamówki foliowe 9 micronów 210 + 2 x 60 x 435 mm (+/-12), 150 sztuk","Reklamówki o wymiarach 210 + 2 x 60 x 435 mm (+/-12) Nawój: 150 sztuk\nFolia HDPE / grubość 9 mikronówJednostka sprzedaży: 1 rolka (150sztuk)\n","op. (150 szt.)",{"$f":"IF('Załącznik 13-F.O. Zad 11-15 '!$V$56,VLOOKUP(C135,'Załącznik 13-F.O. Zad 11-15 '!$C$52:$G$175,5,0),0)","v":0},13,0,null,0,11,0,1,0,0,0,null,0,1,0,null,0]
[null,115,"Worki do segregacji 60 l, niebieskie na papier, 60 x 72 cm","Wytrzymałe worki ułatwiające segregację śmieci dzięki kodowi kolorystycznemu, Mają nadruk informujący, jakie typy odpadów należy do nich wrzucać, a jakich nie należy, Wymiary: 60 x 72 cm","op. (10 worków)",{"$f":"IF('Załącznik 13-F.O. Zad 11-15 '!$V$56,VLOOKUP(C136,'Załącznik 13-F.O. Zad 11-15 '!$C$52:$G$175,5,0),0)","v":0},12,0,2,0,0,0,9,0,0,0,null,0,1,0,null,0]
[null,116,"Worki do segregacji 60 l, zielone na szkło, 60 x 72 cm","Wytrzymałe worki ułatwiające segregację śmieci dzięki kodowi kolorystycznemu, Mają nadruk informujący, jakie typy odpadów należy do nich wrzucać, a jakich nie należy, Wymiary: 60 x 72 cm","op. (10 worków)",{"$f":"IF('Załącznik 13-F.O. Zad 11-15 '!$V$56,VLOOKUP(C137,'Załącznik 13-F.O. Zad 11-15 '!$C$52:$G$175,5,0),0)","v":0},3,0,2,0,0,0,0,0,0,0,null,0,1,0,null,0]
[null,117,"Worki do segregacji 60 l, zółte na plastik, 60 x 72 cm","Wytrzymałe worki ułatwiające segregację śmieci dzięki kodowi kolorystycznemu, Mają nadruk informujący, jakie typy odpadów należy do nich wrzucać, a jakich nie należy, Wymiary: 60 x 72 cm","op. (10 worków)",{"$f":"IF('Załącznik 13-F.O. Zad 11-15 '!$V$56,VLOOKUP(C138,'Załącznik 13-F.O. Zad 11-15 '!$C$52:$G$175,5,0),0)","v":0},3,0,2,0,0,0,0,0,0,0,null,0,1,0,null,0]
[null,118,"Worki na śmieci LDPE sanitarne 120 l, niebieskie, 10 sztuk","Wymiary: 110 x 70 cm, Grubość: folii: 0,03 mm","op (10 szt)",{"$f":"IF('Załącznik 13-F.O. Zad 11-15 '!$V$56,VLOOKUP(C139,'Załącznik 13-F.O. Zad 11-15 '!$C$52:$G$175,5,0),0)","v":0},5,0,null,0,0,0,0,0,0,0,4,0,1,0,null,0]
[null,119,"Worki na śmieci LDPE sanitarne 160 l, czarne, 20 sztuk","Worki na śmieci LDPE sanitarne 160 l, czarne, 20 sztuk Pojemność: 160 l Wymiary: 150 x 90 cm Grubość: folii: 0,027 mm Kolor folii: czarny Jednostka sprzedaży: 1 opakowanie (20 sztuk)","op. (20 sztuk)",{"$f":"IF('Załącznik 13-F.O. Zad 11-15 '!$V$56,VLOOKUP(C140,'Załącznik 13-F.O. Zad 11-15 '!$C$52:$G$175,5,0),0)","v":0},27,0,null,0,0,0,6,0,0,0,20,0,1,0,null,0]
[null,120,"Worki na śmieci LDPE z taśmą ściągającą 60 l, czarne, 10 sztuk","Posiadają taśmę ściągającą Pojemność: 60 l Wymiary: 72 x 60 cm Grubość: folii: 0,02 mm Kolor folii: czarny Jednostka sprzedaży: 1 opakowanie (10 sztuk)","op. (10 sztuk)",{"$f":"IF('Załącznik 13-F.O. Zad 11-15 '!$V$56,VLOOKUP(C141,'Załącznik 13-F.O. Zad 11-15 '!$C$52:$G$175,5,0),0)","v":0},21,0,null,0,0,0,0,0,0,0,20,0,1,0,null,0]
[null,121,"Worki na śmieci łazienkowe, 20 l, białe, 40 sztuk","Idealne worki na odpady łazienkowe, Pojemność: 20 l, Kolor: biały, Rozmiar: 40 x 50 cm","op: (40 sztuk)",{"$f":"IF('Załącznik 13-F.O. Zad 11-15 '!$V$56,VLOOKUP(C142,'Załącznik 13-F.O. Zad 11-15 '!$C$52:$G$175,5,0),0)","v":0},3,0,null,0,0,0,2,0,0,0,null,0,1,0,null,0]
[null,122,"Worki na śmieci MDPE 35 l, niebieskie 20 sztuk","Pojemność: 35 l Wymiary: 58 x 49 cm Grubość: folii: 0,011 mm Kolor folii: niebieski Jednostka sprzedaży: 1 opakowanie (20 sztuk)","op. (20 sztuk)",{"$f":"IF('Załącznik 13-F.O. Zad 11-15 '!$V$56,VLOOKUP(C143,'Załącznik 13-F.O. Zad 11-15 '!$C$52:$G$175,5,0),0)","v":0},42,0,null,0,16,0,5,0,0,0,20,0,1,0,null,0]
[null,null,null,null,null,null,{"$f":"SUM(G22:G143)","v":6907},null,{"$f":"SUM(I22:I143)","v":937},null,{"$f":"SUM(K22:K143)","v":1672},null,{"$f":"SUM(M22:M143)","v":788},null,{"$f":"SUM(O22:O143)","v":2512},null,{"$f":"SUM(Q22:Q143)","v":841},null,{"$f":"SUM(S22:S143)","v":122},null,{"$f":"SUM(U22:U143)","v":35}]
[null,null,null,null,null,null,null,null,"ŁĄCZNA CENA NETTO DLA ENEA Centrum Sp. z o.o. ",{"$f":"SUM(J22:J143)","v":0},"ŁĄCZNA CENA NETTO DLA ENEA Logistyka sp. z o.o.",{"$f":"SUM(L22:L143)","v":0},"ŁĄCZNA CENA NETTO DLA ENEA Operator sp. z.o.o.",{"$f":"SUM(N22:N143)","v":0},"ŁĄCZNA CENA NETTO DLA ENEA Oświetlenie Sp. z o.o.",{"$f":"SUM(P22:P143)","v":0},"ŁĄCZNA CENA NETTO DLA ENEA Pomiary sp. z.o.o.",{"$f":"SUM(R22:R143)","v":0},"ŁĄCZNA CENA NETTO DLA ENEA Serwis Sp. z o.o.",{"$f":"SUM(T22:T143)","v":0},"ŁĄCZNA CENA NETTO DLA ENEA S.A.",{"$f":"SUM(V22:V143)","v":0}]
[]
[]
[]
[null,null,"miejscowość i data",null,null,"Pieczęć imienna i podpis przedstawiciela(i) Wykonawcy"]

{"sheet":"Załącznik16-F.O. dla Zadania 13","index":7,"n_rows":109,"n_cols":16,"rows_kept":109,"cut":false,"hidden":false,"merged":[[18,1,18,2],[107,2,107,3],[107,4,107,7],[108,5,108,7],[2,1,2,7],[4,1,4,7],[8,1,8,7],[11,1,11,7],[14,1,14,7],[16,1,16,7]]}
[null,"Oznaczenie sprawy:  1400/DW00/ZU/KZ/2022/0000079539"]
[]
[null,"ZAŁĄCZNIK NR 16 - FORMULARZ OFERTY DLA ZADANIA 13 - DOSTAWA ARTYKUŁÓW HIGIENICZNYCH: BIAŁYSTOK"]
[]
[]
[null,null,"(pieczęć wykonawcy)"]
[]
[null,"Ja, niżej podpisany (My niżej podpisani):"]
[]
[]
[null,"działając w imieniu i na rzecz:"]
[]
[]
[null,"Składam(y) ofertę na wykonanie zamówienia, którego przedmiotem jest:"]
[null,"Dostawa artykułów biurowych, spożywczych i higienicznych dla spółek GK ENEA"]
[]
[null,"ZADANIE 13 - Dostawa artykułów higienicznych: BIAŁYSTOK"]
[]
[null,"ŁĄCZNA CENA NETTO OFERTY DLA ZADANIA 13:",null,{"$f":"SUM(H22:H103)","v":0}]
[]
[null,"LP","Nazwa produktu","Opis szczegółowy","Jednostka ","cena jednostkowa netto","Ilość","Wartość","ENEA Centrum Sp. z o.o. - Szacowana ilość","ŁĄCZNA CENA NETTO DLA ENEA Centrum Sp. z o.o. ","Enea Ciepło sp.z o.o. (centrala) - Szacowana ilość","ŁĄCZNA CENA NETTO DLA ENEA Ciepło sp. z o.o. (Centrala)","ENEA Ciepło Sp. z o.o. (Oddział) - Szacowana ilość","ŁĄCZNA CENA NETTO DLA ENEA Ciepło Sp. z o.o. (Oddział)","ENEA Logistyka Sp. z o.o. - Szacowana ilość","ŁĄCZNA CENA NETTO DLA ENEA Logistyka Sp. z o.o. "]
[null,1,"Filtr do expresu DELONGHI 45.76X","Filtr do expresu DELONGHI 45.76X","szt",{"$f":"IF('Załącznik 13-F.O. Zad 11-15 '!$V$57,VLOOKUP(C22,'Załącznik 13-F.O. Zad 11-15 '!$C$52:$G$174,5,0),0)","v":0},{"$f":"I22+K22+M22+O22","v":14},{"$f":"G22*F22","v":0},null,{"$f":"I22*F22","v":0},null,{"$f":"K22*F22","v":0},14,{"$f":"M22*F22","v":0},null,{"$f":"O22*F22","v":0}]
[null,2,"ODKAMIENIACZ DO EKSPRESU MELITTA 250ML","odkamieniacz do  ekspresu MELITA poj. 250 ml.","szt. (250 ml)",{"$f":"IF('Załącznik 13-F.O. Zad 11-15 '!$V$57,VLOOKUP(C23,'Załącznik 13-F.O. Zad 11-15 '!$C$52:$G$174,5,0),0)","v":0},{"$f":"I23+K23+M23+O23","v":26},{"$f":"G23*F23","v":0},null,{"$f":"I23*F23","v":0},24,{"$f":"K23*F23","v":0},2,{"$f":"M23*F23","v":0},null,{"$f":"O23*F23","v":0}]
[null,3,"Odkamieniacz KAMIX, w proszku, 150 g","Środek do usuwania osadów z kamienia Pojemność: 150 g Jednostka sprzedaży: 1 opakowanie ","op. ( 150 g)",{"$f":"IF('Załącznik 13-F.O. Zad 11-15 '!$V$57,VLOOKUP(C24,'Załącznik 13-F.O. Zad 11-15 '!$C$52:$G$174,5,0),0)","v":0},81,0,null,0,6,0,73,0,2,0]
[null,4,"Odkamieniacz uniwersalny KAMIX, w płynie, 500 ml","Środek w płynie do usuwania osadów kamienia Pojemność: 500 ml Jednostka sprzedaży: 1 opakowanie ","op. (500 ml)",{"$f":"IF('Załącznik 13-F.O. Zad 11-15 '!$V$57,VLOOKUP(C25,'Załącznik 13-F.O. Zad 11-15 '!$C$52:$G$174,5,0),0)","v":0},30,0,null,0,4,0,26,0,null,0]
[null,5,"Tabletki do czyszczenia sekcji mlecznej ekspresu","Tabletki do codziennego czyszczenia sekcji mlecznej zapewniają dokładne i higieniczne użytkowanie sekcji mlecznej Jednostka sprzedaży: 1 opakowanie","op. ( 62 szt )",{"$f":"IF('Załącznik 13-F.O. Zad 11-15 '!$V$57,VLOOKUP(C26,'Załącznik 13-F.O. Zad 11-15 '!$C$52:$G$174,5,0),0)","v":0},37,0,null,0,36,0,1,0,null,0]
[null,6,"Płyn odkamieniający DELONGHI \"EcoDecalk\"","odkamieniacz do  ekspresu DELONGHI ","szt.   ",{"$f":"IF('Załącznik 13-F.O. Zad 11-15 '!$V$57,VLOOKUP(C27,'Załącznik 13-F.O. Zad 11-15 '!$C$52:$G$174,5,0),0)","v":0},11,0,null,0,4,0,7,0,null,0]
[null,7,"Tabletki czyszczące KRUPS XS3000, 10 sztuk","Tabletki czyszczące przeznaczone do ekspresów ciśnieniowych i przelewowych Usuwają tłuszcz i pozostałości po kawie wewnątrz ekspresu. Regularne stosowanie gwarantuje utrzymanie wysokiej jakości kawy Jednostka sprzedaży: 1 opakowanie (10 sztuk)","op (10 szt)",{"$f":"IF('Załącznik 13-F.O. Zad 11-15 '!$V$57,VLOOKUP(C28,'Załącznik 13-F.O. Zad 11-15 '!$C$52:$G$174,5,0),0)","v":0},5,0,null,0,4,0,1,0,null,0]
[null,8,"Tabletki do zmywarek FINISH All-in-1, 50 tabletek","Jego unikalna formuła łączy w sobie działanie 10 funkcji Power Actions: usuwanie zaplamień, usuwanie tłuszczu, namaczanie, usuwanie zabrudzeń po herbacie, kryształowy połyski, lśniące sztućce, ochrona przed osadzaniem się kamienia w zmywarce, aktywna ochrona szkła, ochrona srebra, usuwanie opornych zabrudzeń, Dodatkowo spełnia funkcje soli i płynu nabłyszczającego, Składniki: 5 - 15 % związki wybielające na bazie tlenu, niejonowe środki powierzchniowo czynne, do 5 % polikarboksylany, fosfoniany. Enzymy (subtylizyna, amylaza), kompozycja zapachowa.","op (50 szt)",{"$f":"IF('Załącznik 13-F.O. Zad 11-15 '!$V$57,VLOOKUP(C29,'Załącznik 13-F.O. Zad 11-15 '!$C$52:$G$174,5,0),0)","v":0},54,0,null,0,8,0,46,0,null,0]
[null,9,"UNIWERSALNY zestaw do odkamieniania ekspresów","Uniwerslany zestaw do odkamieniania ekspresów Nespresso. Ilość sztuk w opakowaniu: 2 Jednostka sprzedaży: 1 opakowanie","op",{"$f":"IF('Załącznik 13-F.O. Zad 11-15 '!$V$57,VLOOKUP(C30,'Załącznik 13-F.O. Zad 11-15 '!$C$52:$G$174,5,0),0)","v":0},4,0,null,0,4,0,0,0,null,0]
[null,10,"Apteczka VERA TOP 15 PLUS, DIN 13157, w walizce z ABS","Apteczka w walizce z tworzywa ABS. Zawiera stelaż mocujący do ściany W skład wyposażenia wchodzą: kompres zimny – 1 szt., kompres na oko – 2 szt., kompres 10 x 10 cm - 3 opakowania (po 2 sztuki) opaska elastyczna 4 m x 6 cm – 2 szt., opaska elastyczna 4 m x 8 cm – 2 szt., zestaw plastrów 10 x 6 cm (8 szt.) – 1 komplet, zestaw plastrów (14 szt.) – 1 komplet, plaster 5 m x 2,5 cm – 1 szt., opatrunek indywidualny M sterylny – 3 szt. opatrunek indywidualny G sterylny – 1 szt., opatrunek indywidualny K sterylny – 1 szt., chusta opatrunkowa 60 x 80 cm – 1 szt. chusta trójkątna – 1 szt., chusta z flizeliny (5 szt.) – 1 komplet, koc ratunkowy 160 x 210 cm – 1 szt. nożyczki 19 cm – 1 szt., rękawice winylowe – 4 szt. chusteczka dezynfekująca – 6 sztuk, ustnik do sztucznego oddychania – 1 szt., instrukcja udzielania pierwszej pomocy Skład zgodny z normą DIN 13157. Rozmiar: 330 x 235 x 125 mm Jednostka sprzedaży: 1 sztuka","szt",{"$f":"IF('Załącznik 13-F.O. Zad 11-15 '!$V$57,VLOOKUP(C31,'Załącznik 13-F.O. Zad 11-15 '!$C$52:$G$174,5,0),0)","v":0},4,0,1,0,3,0,0,0,null,0]
[null,11,"Wyposażenie apteczki DIN 13157 PLUS","Czajnik posiada filtr antywapienny, który zapobiega przedostawaniu się kamienia do szklanki, Pojemność: 1,7 l Moc: 2400 W","op",{"$f":"IF('Załącznik 13-F.O. Zad 11-15 '!$V$57,VLOOKUP(C32,'Załącznik 13-F.O. Zad 11-15 '!$C$52:$G$174,5,0),0)","v":0},6,0,1,0,3,0,2,0,null,0]
[null,12,"Chusteczki KATRIN Plus, 100 sztuk","Białe, dwuwarstwowe chusteczki higieniczne w praktycznym podajniku Testowane dermatologicznie Jednostka sprzedaży: 1 opakowanie (100 sztuk) ","op (100 szt)",{"$f":"IF('Załącznik 13-F.O. Zad 11-15 '!$V$57,VLOOKUP(C33,'Załącznik 13-F.O. Zad 11-15 '!$C$52:$G$174,5,0),0)","v":0},36,0,null,0,36,0,0,0,null,0]
[null,13,"Czajnik elektryczny TEFAL Express 1,5 l, biały","Filtr antywapienny i dwustronny wskaźnik poziomu wody, Możliwość zagotowania minimalnej ilości wody (250 ml), Pojemność: 1,5 l, Moc: 2400 W","szt",{"$f":"IF('Załącznik 13-F.O. Zad 11-15 '!$V$57,VLOOKUP(C34,'Załącznik 13-F.O. Zad 11-15 '!$C$52:$G$174,5,0),0)","v":0},10,0,null,0,8,0,2,0,null,0]
[null,14,"Czajnik elektryczny TEFAL Loft, 1,7 l, czarny","Zdejmowana pokrywa ułatwia napełnianie wodą, Czajnik posiada filtr antywapienny, który zapobiega przedostawaniu się kamienia do szklanki, Pojemność: 1,7 l, Moc: 2400 W","szt",{"$f":"IF('Załącznik 13-F.O. Zad 11-15 '!$V$57,VLOOKUP(C35,'Załącznik 13-F.O. Zad 11-15 '!$C$52:$G$174,5,0),0)","v":0},22,0,null,0,8,0,13,0,1,0]
[null,15,"Czyściwo włókninowe, wielozadaniowe do trudnych zabrudzeń TORK, 1 rolka","Jednowarstwowe, grube i mocne czyściwo wielozadaniowe non-woven (syntetyczno-celulozowe) Duża chłonność, także oleistych substancji Niskopylne i odporne na rozerwania Współpracuje z rozpuszczalnikami, ograniczając ich zużycie Polecane do stosowania w przemyśle maszynowym, poligraficznym, spożywczym  nawet do najcięższych zadań związanych z czyszczeniem Atest PZH i certyfikat ISEGA, zezwalający na stosowanie produktu w przemyśle spożywczym W wygodnym kartonie mogącym służyć jako dozownik Perforacja co 38 cm Materiał: włóknina jednowarstwowa Tłoczenie: nie Ilość listków: 280  szerokość listka: 320 mm Długość roli: 106,4 m  średnica r[...]","szt",{"$f":"IF('Załącznik 13-F.O. Zad 11-15 '!$V$57,VLOOKUP(C36,'Załącznik 13-F.O. Zad 11-15 '!$C$52:$G$174,5,0),0)","v":0},6,0,null,0,6,0,0,0,null,0]
[null,16,"Kij z mopem sznurkowym, 1 komplet","Kij z mopem sznurkowym, Waga: 345 g, Jednostka sprzedaży: 1 sztuka","szt",{"$f":"IF('Załącznik 13-F.O. Zad 11-15 '!$V$57,VLOOKUP(C37,'Załącznik 13-F.O. Zad 11-15 '!$C$52:$G$174,5,0),0)","v":0},3,0,null,0,2,0,1,0,null,0]
[null,17,"Ściereczki gąbczaste niebieskie, 3 sztuki","Bardzo trwałe i chłonne ścierki gąbczaste, wzmocnione wewnętrzną bawełnianą siatką, Najlepsze do wycierania wody, zmywania powierzchni i usuwania brudu","op. (3 szt)",{"$f":"IF('Załącznik 13-F.O. Zad 11-15 '!$V$57,VLOOKUP(C38,'Załącznik 13-F.O. Zad 11-15 '!$C$52:$G$174,5,0),0)","v":0},12,0,null,0,10,0,2,0,null,0]
[null,18,"Ścierka do podłogi, 50 x 60 cm, pomarańczowa","Ścierka do podłogi, 50 x 60 cm, pomarańczowaWymiary: 50 x 60 cm, Do czyszczenia dużych powierzchni","szt",{"$f":"IF('Załącznik 13-F.O. Zad 11-15 '!$V$57,VLOOKUP(C39,'Załącznik 13-F.O. Zad 11-15 '!$C$52:$G$174,5,0),0)","v":0},15,0,null,0,8,0,7,0,null,0]
[null,19,"Ścierka z mikrofibry KOLORADO, 35 x 35 cm","Ścierka z mikrofibry przeznaczona do czyszczenia powierzchni szklanych i stosowania w łazience, Skuteczna na sucho i mokro, Nie pozostawia smug, zacieków ani kłaczków, Skład: 80% poliester, 20% poliamid (nylon)","szt",{"$f":"IF('Załącznik 13-F.O. Zad 11-15 '!$V$57,VLOOKUP(C40,'Załącznik 13-F.O. Zad 11-15 '!$C$52:$G$174,5,0),0)","v":0},25,0,null,0,7,0,18,0,null,0]
[null,20,"Ścierki uniwersalne Practi Maxi 50sztuk","Ścierki uniwersalne Practi Maxi 50sztuk rozmiar 25 x 40","op (50 szt)",{"$f":"IF('Załącznik 13-F.O. Zad 11-15 '!$V$57,VLOOKUP(C41,'Załącznik 13-F.O. Zad 11-15 '!$C$52:$G$174,5,0),0)","v":0},6,0,null,0,6,0,0,0,null,0]
[null,21,"Ścierki uniwersalne, 5 sztuk","Ścierki wielokrotnego użytku Można je prać i sterylizować Wykonane z wiskozy, pachnące Miks kolorów Wymiary: 37 x 38 cm","op (5 szt)",{"$f":"IF('Załącznik 13-F.O. Zad 11-15 '!$V$57,VLOOKUP(C42,'Załącznik 13-F.O. Zad 11-15 '!$C$52:$G$174,5,0),0)","v":0},28,0,null,0,6,0,22,0,null,0]
[null,22,"Chusteczki FELLOWES do czyszczenia ekranów, opakowanie 100szt","Chusteczki FELLOWES do czyszczenia ekranów, opakowanie 100szt","op (100 szt)",{"$f":"IF('Załącznik 13-F.O. Zad 11-15 '!$V$57,VLOOKUP(C43,'Załącznik 13-F.O. Zad 11-15 '!$C$52:$G$174,5,0),0)","v":0},80,0,2,0,72,0,6,0,null,0]
[null,23,"Płyn AJAX Floral Fiesta, 1 l","Doskonale usuwa kurz i brud, pozostawiając na długo świeży zapach Miks zapachów Pojemność: 1 l Jednostka sprzedaży 1 sztuka","op (1l)",{"$f":"IF('Załącznik 13-F.O. Zad 11-15 '!$V$57,VLOOKUP(C44,'Załącznik 13-F.O. Zad 11-15 '!$C$52:$G$174,5,0),0)","v":0},3,0,null,0,null,0,3,0,null,0]
[null,24,"Preparat do usuwania tłustego brudu VOIGT C457 Ultra Clean plus 1 l","Odtłuszczanie, gruntowne mycie bez fosforanów – Produkt do profesjonalnego zastosowania, Nie zawierający fosforanów, Usuwa zabrudzenia pochodzenia tłuszczowego i przemysłowego m.in. oleje, smary. Zalecany do: warsztatów, hal produkcyjnych, galerii handlowych, centrów logistycznych","op (1l)",{"$f":"IF('Załącznik 13-F.O. Zad 11-15 '!$V$57,VLOOKUP(C45,'Załącznik 13-F.O. Zad 11-15 '!$C$52:$G$174,5,0),0)","v":0},10,0,null,0,3,0,7,0,null,0]
[null,25,"Rozpuszczalnik do etykiet w sprayu, pojemność 200 ml","Produkt zapewnia w pełni bezpieczne usunięcie etykiet z dowolnej powierzchni, nie pozostawiając żadnych, śladów kleju. Pojemność 200 ml.","op (200 ml)",{"$f":"IF('Załącznik 13-F.O. Zad 11-15 '!$V$57,VLOOKUP(C46,'Załącznik 13-F.O. Zad 11-15 '!$C$52:$G$174,5,0),0)","v":0},8,0,1,0,2,0,5,0,null,0]
[null,26,"Gąbka do zmywania różowa, 5 sztuk","Gąbka do różnorodnych zastosowań, Kolor: różowy","op (5 szt)",{"$f":"IF('Załącznik 13-F.O. Zad 11-15 '!$V$57,VLOOKUP(C47,'Załącznik 13-F.O. Zad 11-15 '!$C$52:$G$174,5,0),0)","v":0},13,0,null,0,4,0,9,0,null,0]
[null,27,"Gąbki do zmywania standardowa, 5 sztuk","Do zmywania naczyń, szkła, ceramiki, powierzchni emaliowanych Wytrzymała Miks kolorów w opakowaniu Jednostka sprzedaży: 1 opakowanie (5 sztuk) Opakowanie zbiorcze: 18 opakowań","op (5 szt)",{"$f":"IF('Załącznik 13-F.O. Zad 11-15 '!$V$57,VLOOKUP(C48,'Załącznik 13-F.O. Zad 11-15 '!$C$52:$G$174,5,0),0)","v":0},53,0,null,0,4,0,49,0,null,0]
[null,28,"Kuchenka mikrofalowa SEVERIN 7890/7862, biała","5 poziomów mocy, Rozmrażanie w oparciu o czas i wagę, 35-minutowy timer z sygnałem akustycznym, Pokrętło regulacyjne z chromowanymi elementami, Średnica wyjmowanego talerza ok. 25,4 cm, Wysokość komory ok. 16,5 cm, Obudowa i komora lakierowana powłoką odporną na wysokie temperatur, Wymiary: szer. 43,5, gł. 34,5, wys. 25,4 cm, Moc: 700 W","szt",{"$f":"IF('Załącznik 13-F.O. Zad 11-15 '!$V$57,VLOOKUP(C49,'Załącznik 13-F.O. Zad 11-15 '!$C$52:$G$174,5,0),0)","v":0},5,0,null,0,2,0,3,0,null,0]
[null,29,"Jednorazowa maska higieniczna 3-warstwowa, niebieska, 50 sztuk","Trójwarstwowa maska higieniczna. Wykonana z włókniny polipropylenowej (100%). Materiał: Texfil 25 (Spunbond) + Texfil 25 (Spunbond) + Texfil 25 (Spunbond). Gramatura: 25 gsm + 25 gsm + 25 gsm= 75 gsm. Gumki – długość 16cm - 18cm (± 1cm).","op (50szt)",{"$f":"IF('Załącznik 13-F.O. Zad 11-15 '!$V$57,VLOOKUP(C50,'Załącznik 13-F.O. Zad 11-15 '!$C$52:$G$174,5,0),0)","v":0},215,0,null,0,200,0,15,0,null,0]
[null,30,"Półmaska FILTERSERVICE FS-623V NR D, FFP2, z zaworem, 10 sztuk","Czasza półmaski: - Igłowana włóknina poliestrowa,  - Włóknina polipropylenowa typu melt blown, - Włóknina osłonowa, - Zawór wydechowy, - Zapinki taśm nagłowia, - Taśma nagłowia","op (10szt)",{"$f":"IF('Załącznik 13-F.O. Zad 11-15 '!$V$57,VLOOKUP(C51,'Załącznik 13-F.O. Zad 11-15 '!$C$52:$G$174,5,0),0)","v":0},30,0,null,0,30,0,0,0,null,0]
[null,31,"Nawilżacz powietrza NU 5N","4 poziomy intensywności nawilżania, Automatyczna kontrola wilgotności, Demontowany zasobnik wody 5,2 l, Funkcja jonizacji","szt",{"$f":"IF('Załącznik 13-F.O. Zad 11-15 '!$V$57,VLOOKUP(C52,'Załącznik 13-F.O. Zad 11-15 '!$C$52:$G$174,5,0),0)","v":0},2,0,null,0,1,0,1,0,null,0]
[null,32,"Odświeżacz powietrza AMBI PUR, zapach kwiatowy, 300 ml","Wypełnia pomieszczenie zapachem najpiękniejszego wiosennego bukietu Pojemność: 300 ml Jednostka sprzedaży: 1 sztuka Opakowanie zbiorcze: 6 sztuk","szt",{"$f":"IF('Załącznik 13-F.O. Zad 11-15 '!$V$57,VLOOKUP(C53,'Załącznik 13-F.O. Zad 11-15 '!$C$52:$G$174,5,0),0)","v":0},38,0,null,0,18,0,20,0,null,0]
[null,33,"Odświeżacz powietrza BRISE w sprayu","Odświeżając pomieszczenia pozostawia przyjemny zapach Pojemność: 300 ml Jednostka sprzedaży: 1 sztuka ","szt.",{"$f":"IF('Załącznik 13-F.O. Zad 11-15 '!$V$57,VLOOKUP(C54,'Załącznik 13-F.O. Zad 11-15 '!$C$52:$G$174,5,0),0)","v":0},58,0,null,0,6,0,52,0,null,0]
[null,34,"Odświeżacz powietrza BRISE w żelu, miks zapachów","Masa netto: 150 g Miks zapachów Jednostka sprzedaży: 1 sztuka ","szt.",{"$f":"IF('Załącznik 13-F.O. Zad 11-15 '!$V$57,VLOOKUP(C55,'Załącznik 13-F.O. Zad 11-15 '!$C$52:$G$174,5,0),0)","v":0},27,0,null,0,12,0,15,0,null,0]
[null,35,"Odświeżacz powietrza GREEN FRESH, 400 ml","Skutecznie neutralizuje i pochłania nieprzyjemne zapachy\nOdświeża i nawilża powietrze, pozostawiając w pomieszczeniu uczucie świeżości i czystości Pojemność: 400 ml Jednostka sprzedaży: 1 sztuka","op. (400 ml)",{"$f":"IF('Załącznik 13-F.O. Zad 11-15 '!$V$57,VLOOKUP(C56,'Załącznik 13-F.O. Zad 11-15 '!$C$52:$G$174,5,0),0)","v":0},23,0,null,0,12,0,11,0,null,0]
[null,36,"Patyczki zapachowe PACHNĄCA SZAFA, Słoneczne popołudnie, 50 ml","Patyczki zapachowe PACHNĄCA SZAFA nadają przyjemny i odświeżający zapach w każdym pomieszczeniu. Odświeżać ma bardzo ładną formę eleganckich patyczków w szklanym flakoniku.","op (50 ml)",{"$f":"IF('Załącznik 13-F.O. Zad 11-15 '!$V$57,VLOOKUP(C57,'Załącznik 13-F.O. Zad 11-15 '!$C$52:$G$174,5,0),0)","v":0},101,0,null,0,64,0,37,0,null,0]
[null,37,"Wkład do odświeżacza AMBI PUR, zapach ocean and wind","Wkład do elektrycznego odświeżacza powietrza AMBI PUR (6.630.347) Wydajność wkładów: do 80 dni Jednostka sprzedaży: 1 sztuka ","szt",{"$f":"IF('Załącznik 13-F.O. Zad 11-15 '!$V$57,VLOOKUP(C58,'Załącznik 13-F.O. Zad 11-15 '!$C$52:$G$174,5,0),0)","v":0},83,0,null,0,44,0,39,0,null,0]
[null,38,"Papier toaletowy CLASSIC, biały, 8 rolek","Papier toaletowy CLASSIC, biały, 8 rolek Wymiary listka: szer. 100 x dł. 112 mm, Szerokość taśmy: 100 mm","op. (8 rolek)",{"$f":"IF('Załącznik 13-F.O. Zad 11-15 '!$V$57,VLOOKUP(C59,'Załącznik 13-F.O. Zad 11-15 '!$C$52:$G$174,5,0),0)","v":0},6,0,null,0,null,0,6,0,null,0]
[null,39,"Supermocny Plaster do cięcia VISCOPLAST, 1 m x 8 cm","Opatrunek włókninowy o wysokiej chłonności, Plaster natychmiast przykleja się do skóry, nawet do wilgotnej, Ogranicza przywieranie opatrunku do rany","op (1m)",{"$f":"IF('Załącznik 13-F.O. Zad 11-15 '!$V$57,VLOOKUP(C60,'Załącznik 13-F.O. Zad 11-15 '!$C$52:$G$174,5,0),0)","v":0},7,0,1,0,6,0,0,0,null,0]
[null,40,"Uniwersalny zestaw plastrów 3M VISCOPLAST, 24 sztuki","Plastry z opatrunkiem do opatrywania drobnych ran i skaleczeń Hypoalergiczne i wodoodporne Przepuszczające powietrze W opakowaniu 24 plastry: plastry Minifol: 72 x 25 mm - 4 sztuki, 72 x 19 mm - 8 sztuk, 57 x 16 mm - 6 sztuk, 38x10 mm - 4 sztuki Plaster Prestopor 10 x 6 cm Plaster Prestovis Plus 10 x 6 cm Jednostka sprzedaży: 1 opakowanie","op. ( 24 szt)",{"$f":"IF('Załącznik 13-F.O. Zad 11-15 '!$V$57,VLOOKUP(C61,'Załącznik 13-F.O. Zad 11-15 '!$C$52:$G$174,5,0),0)","v":0},7,0,1,0,6,0,0,0,null,0]
[null,41,"Krem do rąk EVELINE ''Niewidzialne rękawiczki'', 100 ml","Odżywczo-ochronny krem do rąk z formułą witaminową Polecany do suchych i podrażnionych dłoni Pojemność: 100 ml Jednostka sprzedaży: 1 sztuka ","op do (100 ml)",{"$f":"IF('Załącznik 13-F.O. Zad 11-15 '!$V$57,VLOOKUP(C62,'Załącznik 13-F.O. Zad 11-15 '!$C$52:$G$174,5,0),0)","v":0},4,0,null,0,4,0,0,0,null,0]
[null,42,"Chusteczki higieniczne VELVET, 120 sztuk","Chusteczki higieniczne VELVET, 120 sztuk. W opakowaniu 120 sztuk, Produkt ma atest PZH, ","op (120 szt)",{"$f":"IF('Załącznik 13-F.O. Zad 11-15 '!$V$57,VLOOKUP(C63,'Załącznik 13-F.O. Zad 11-15 '!$C$52:$G$174,5,0),0)","v":0},32,0,null,0,32,0,0,0,null,0]
[null,43,"Ręcznik w roli ESTIMO 100/2, 500 listków","Wytrzymały, dwuwarstwowy ręcznik w 100% wykonany z celulozy o wysokich parametrach i pięknym designie Długość rolki: 100 m W rolce 500 odcinków o wymiarach: 20,3 x 20 cm Kolor biały Jednostka sprzedaży: 1 rolka ","op. (rolka 100 m)",{"$f":"IF('Załącznik 13-F.O. Zad 11-15 '!$V$57,VLOOKUP(C64,'Załącznik 13-F.O. Zad 11-15 '!$C$52:$G$174,5,0),0)","v":0},40,0,null,0,6,0,34,0,null,0]
[null,44,"Ręczniki papierowe białe, składka V, 20 x 200 listków","Gofrowane ręczniki w składce Kompatybilne ze standardowymi dozownikami do ręczników typu ZZ Materiał: makulatura jednowarstwowa Wymiary listka: 25 x 23 cm Gramatura: 1 x 30 g/m² Ilość bind w opakowaniu: 20 Ilość listków w bindzie: 200 Kolor: biały Jednostka sprzedaży: 1 karton (4000 listków)","op. (20 x 200 listków)",{"$f":"IF('Załącznik 13-F.O. Zad 11-15 '!$V$57,VLOOKUP(C65,'Załącznik 13-F.O. Zad 11-15 '!$C$52:$G$174,5,0),0)","v":0},1,0,1,0,null,0,0,0,null,0]
[null,45,"Rękawice antystatyczne ANSELL HyFlex® 11-800, rozmiar 9, para","Nylonowe rękawice z powłoką z pianki nitrylowej, wykonane w technologii KnitZonz™ Wszechstronne rozwiązanie do precyzyjnego montażu i prac ogólnych Zaawansowana technologia dziania zapewnia większą rozciągliwość i elastyczność w miejscach o zwiększonym nacisku Antystatyczne, zgodne z normą EN 1149 Norma EN 388 3131 (EN 388:2016 3131A) Rozmiar: 9 Jednostka sprzedaży: 1 para ","op. (1 para)",{"$f":"IF('Załącznik 13-F.O. Zad 11-15 '!$V$57,VLOOKUP(C66,'Załącznik 13-F.O. Zad 11-15 '!$C$52:$G$174,5,0),0)","v":0},7,0,null,0,7,0,0,0,null,0]
[null,46,"Rękawice nitrylowe MEDASEPT PRIME, niebieskie, rozmiar M, 100 sztuk","Rękawice nitrylowe diagnostyczne i ochronne","op. (100 szt)",{"$f":"IF('Załącznik 13-F.O. Zad 11-15 '!$V$57,VLOOKUP(C67,'Załącznik 13-F.O. Zad 11-15 '!$C$52:$G$174,5,0),0)","v":0},7,0,null,0,7,0,0,0,null,0]
[null,47,"Ręcznik kuchenny VELVET Jumbo, 1 rolka","Dwuwarstwowy ręcznik papierowy, który świetnie nadaje się do generalnych porządków, prac w garażu, ogrodzie oraz w kuchni Giga rola = 13 standardowych rolek Nie tylko chłonny i wytrzymały, ale także wyjątkowo wydajny Jedna rolka zawiera aż 520 listków Wysokość rolki: 22 cm Kolor biały Jednostka sprzedaży: 1 rolka ","szt ( 1 rolka)",{"$f":"IF('Załącznik 13-F.O. Zad 11-15 '!$V$57,VLOOKUP(C68,'Załącznik 13-F.O. Zad 11-15 '!$C$52:$G$174,5,0),0)","v":0},36,0,null,0,6,0,30,0,null,0]
[null,48,"Łyżeczki do herbaty AMEFA Bologna, 12 sztuk","subtelne i eleganckie łyżeczki do herbaty, Sztućce polerowane, stal 18/0","op (12 szt)",{"$f":"IF('Załącznik 13-F.O. Zad 11-15 '!$V$57,VLOOKUP(C69,'Załącznik 13-F.O. Zad 11-15 '!$C$52:$G$174,5,0),0)","v":0},2,0,null,0,2,0,0,0,null,0]
[null,49,"Łyżki AMEFA Bologna, 12 sztuk","Sztućce polerowane, stal 18/0","op (12 szt)",{"$f":"IF('Załącznik 13-F.O. Zad 11-15 '!$V$57,VLOOKUP(C70,'Załącznik 13-F.O. Zad 11-15 '!$C$52:$G$174,5,0),0)","v":0},2,0,null,0,2,0,0,0,null,0]
[null,50,"Widelce AMEFA Bologna, 12 sztuk","\nSztućce polerowane, stal 18/0, ","op (12 szt)",{"$f":"IF('Załącznik 13-F.O. Zad 11-15 '!$V$57,VLOOKUP(C71,'Załącznik 13-F.O. Zad 11-15 '!$C$52:$G$174,5,0),0)","v":0},2,0,null,0,2,0,0,0,null,0]
[null,51,"Ściereczki mokre do mebli drewnianych PRESTO, opakowanie 72 sztuki","Ściereczki nawilżane do czyszczenia różnych powierzchni, Usuwają kurz i zapobiegają jego osadzaniu, Nadają połysk czyszczonym powierzchniom","op. (72 szt)",{"$f":"IF('Załącznik 13-F.O. Zad 11-15 '!$V$57,VLOOKUP(C72,'Załącznik 13-F.O. Zad 11-15 '!$C$52:$G$174,5,0),0)","v":0},8,0,null,0,6,0,2,0,null,0]
[null,52,"Kulki do toalet BREF Power Activ, 50 g, zapach cytrynowy","Nowoczesne rozwiązanie w postaci czterech kulek na wygodnej zawieszce Czyszczą, pozostawiają przyjemny zapach i chronią przed osadzaniem się kamienia Masa netto: 50 g Jednostka sprzedaży: 1 sztuka Opakowanie zbiorcze: 10 sztuk","op. (50 g)",{"$f":"IF('Załącznik 13-F.O. Zad 11-15 '!$V$57,VLOOKUP(C73,'Załącznik 13-F.O. Zad 11-15 '!$C$52:$G$174,5,0),0)","v":0},5,0,null,0,null,0,5,0,null,0]
[null,53,"Kulki do toalet BREF Power Activ, 50 g, zapach morski","Nowoczesne rozwiązanie w postaci czterech kulek na wygodnej zawieszce Czyszczą, pozostawiają przyjemny zapach i chronią przed osadzaniem się kamienia Masa netto: 50 g Jednostka sprzedaży: 1 sztuka ","op. (50 g)",{"$f":"IF('Załącznik 13-F.O. Zad 11-15 '!$V$57,VLOOKUP(C74,'Załącznik 13-F.O. Zad 11-15 '!$C$52:$G$174,5,0),0)","v":0},5,0,null,0,null,0,5,0,null,0]
[null,54,"Płyn CILIT Bang Kamień i brud, 750 ml","Żel CILIT kamień i brud z Turbo Power. Do czyszczenia wanien, kabin prysznicowych, płytek, toalet, armatury kuchennej i łazienkowej Usuwa kamień, rdzawe zacieki z twardej wody, osad z mydła i inne zabrudzenia Pojemność: 750 ml Jednostka sprzedaży: 1 sztuka","op. (750 ml)",{"$f":"IF('Załącznik 13-F.O. Zad 11-15 '!$V$57,VLOOKUP(C75,'Załącznik 13-F.O. Zad 11-15 '!$C$52:$G$174,5,0),0)","v":0},22,0,null,0,6,0,16,0,null,0]
[null,55,"Płyn do WC DOMESTOS 24H, 1,25 l, cytrynowy","Produkt czyszcząco-dezynfekująco-wybielający Możliwość stosowania do: muszli klozetowych, umywalek, zlewów itp. Produkt nadaje się także do wybielania tkanin Jednostka sprzedaży: 1 sztuka Pojemność: 1,25 l ","op. (1,25 l)",{"$f":"IF('Załącznik 13-F.O. Zad 11-15 '!$V$57,VLOOKUP(C76,'Załącznik 13-F.O. Zad 11-15 '!$C$52:$G$174,5,0),0)","v":0},19,0,null,0,null,0,19,0,null,0]
[null,56,"Zawieszka do WC DOMESTOS, zapach leśny","Zawieszki czyszczące do toalet Chronią przed osadzaniem się kamienia i pozostawiają świeży zapach Jednostka sprzedaży 1 sztuka ","szt",{"$f":"IF('Załącznik 13-F.O. Zad 11-15 '!$V$57,VLOOKUP(C77,'Załącznik 13-F.O. Zad 11-15 '!$C$52:$G$174,5,0),0)","v":0},6,0,null,0,6,0,0,0,null,0]
[null,57,"Żel CLINEX Drill do udrażniania odpływów, 1 l","Szybko rozpuszcza wszelkie stałe i organiczne zanieczyszczenia takie jak: tłuszcz, papier, wata, odpadki kuchenne, Forma żelowa pozwala na osadzanie się preparatu na ściankach rur, przedłużając proces działania, Likwiduje nieprzyjemne zapachy, Nadaje się do udrażniania rur zarówno w kuchni, jak i w łazience","op. (1 l)",{"$f":"IF('Załącznik 13-F.O. Zad 11-15 '!$V$57,VLOOKUP(C78,'Załącznik 13-F.O. Zad 11-15 '!$C$52:$G$174,5,0),0)","v":0},29,0,null,0,8,0,21,0,null,0]
[null,58,"Biobójczy płyn do dezynfekcji rąk HISKIN, 1 l","Produkt przeznaczony do codziennego stosowania przez użytkownika powszechnego. Wykazuje działanie bakteriobójcze, grzybobójcze i wirusobójcze","op. (1 l)",{"$f":"IF('Załącznik 13-F.O. Zad 11-15 '!$V$57,VLOOKUP(C79,'Załącznik 13-F.O. Zad 11-15 '!$C$52:$G$174,5,0),0)","v":0},5,0,null,0,null,0,5,0,null,0]
[null,59,"Dozownik do mydła w płynie MERIDA TOP, biały","Mocny i trwały dozownik do mydła w płynie wykonany z tworzywa ABS Okienko umożliwiające kontrolę zużycia mydła Pojemność: 0,8 l Zestaw do montażu w komplecie Wymiary: dł. 11,5 x szer.11,5 x wys. 25 cm Kolor: biały Jednostka sprzedaży: 1 sztuka","szt.",{"$f":"IF('Załącznik 13-F.O. Zad 11-15 '!$V$57,VLOOKUP(C80,'Załącznik 13-F.O. Zad 11-15 '!$C$52:$G$174,5,0),0)","v":0},4,0,null,0,4,0,0,0,null,0]
[null,60,"Mydło toaletowe NIVEA, 100 g","Kremowe mydło z odżywczym olejkiem migdałowym Miks zapachów Jednostka sprzedaży: 1 sztuka ","szt. (100 g)",{"$f":"IF('Załącznik 13-F.O. Zad 11-15 '!$V$57,VLOOKUP(C81,'Załącznik 13-F.O. Zad 11-15 '!$C$52:$G$174,5,0),0)","v":0},4,0,null,0,4,0,0,0,null,0]
[null,61,"Pasta BHP do rąk, ścierna, 500 g","Usuwa silne zabrudzenia smarami, tłuszczami, sadzami","op. (500g)",{"$f":"IF('Załącznik 13-F.O. Zad 11-15 '!$V$57,VLOOKUP(C82,'Załącznik 13-F.O. Zad 11-15 '!$C$52:$G$174,5,0),0)","v":0},2,0,null,0,2,0,0,0,null,0]
[null,62,"Pasta do rąk MERIDA PA12, 500 ml","Usuwa wszelkie zabrudzenia nawet powstałe od smarów i olejów, Oszczędna w użyciu, Jest niealkaliczna i nie zawiera mineralnych środków ściernych","op. (500 ml)",{"$f":"IF('Załącznik 13-F.O. Zad 11-15 '!$V$57,VLOOKUP(C83,'Załącznik 13-F.O. Zad 11-15 '!$C$52:$G$174,5,0),0)","v":0},8,0,6,0,2,0,0,0,null,0]
[null,63,"Kapsułki do zmywarek FAIRY Jar All in 1, 115 kapsułek","Wydajne kapsułki do maszynowego mycia naczyń Jednostka sprzedaży: 1 opakowanie (115 kapsułek) ","op. ( 115 szt)",{"$f":"IF('Załącznik 13-F.O. Zad 11-15 '!$V$57,VLOOKUP(C84,'Załącznik 13-F.O. Zad 11-15 '!$C$52:$G$174,5,0),0)","v":0},5,0,null,0,5,0,0,0,null,0]
[null,64,"Płyn do czyszczenia zmywarek FINISH, 250 ml","Płyn do czyszczenia zmywarek o zapachu cytrynowym Pojemność: 250 ml Jednostka sprzedaży 1 opakowanie","op (250 ml)",{"$f":"IF('Załącznik 13-F.O. Zad 11-15 '!$V$57,VLOOKUP(C85,'Załącznik 13-F.O. Zad 11-15 '!$C$52:$G$174,5,0),0)","v":0},36,0,null,0,12,0,24,0,null,0]
[null,65,"Płyn do mycia naczyń LUDWIK 1150 g","Posiada bardzo dobre właściwości myjące oraz wysoką zdolność do emulgowania tłuszczów zarówno w ciepłej, jak i zimnej wodzie. Nie pozostawia zacieków na umytych powierzchniach, nadaje im połysk bez konieczności wycierania do sucha. Nowa receptura została również wzbogacona kompleksem witamin A,E,F,H, mającym działanie ochronne i odżywcze dla skóry rąk, Polecany również do mycia mebli, lodówek, wykładzin, podłóg, glazury, dywanów i tworzyw sztucznych","op. (1150 g)",{"$f":"IF('Załącznik 13-F.O. Zad 11-15 '!$V$57,VLOOKUP(C86,'Załącznik 13-F.O. Zad 11-15 '!$C$52:$G$174,5,0),0)","v":0},4,0,null,0,null,0,4,0,null,0]
[null,66,"Płyn do mycia naczyń LUDWIK cytrynowy, 5 kg","Posiada bardzo dobre właściwości myjące oraz wysoką zdolność do emulgowania tłuszczów zarówno w ciepłej, jak i zimnej wodzie. Nie pozostawia zacieków na umytych powierzchniach, nadaje im połysk bez konieczności wycierania do sucha. Nowa receptura została również wzbogacona kompleksem witamin A,E,F,H, mającym działanie ochronne i odżywcze dla skóry rąk, Polecany również do mycia mebli, lodówek, wykładzin, podłóg, glazury, dywanów i tworzyw sztucznych","5 kg",{"$f":"IF('Załącznik 13-F.O. Zad 11-15 '!$V$57,VLOOKUP(C87,'Załącznik 13-F.O. Zad 11-15 '!$C$52:$G$174,5,0),0)","v":0},{"$f":"I87+K87+M87+O87","v":16},{"$f":"G87*F87","v":0},null,{"$f":"I87*F87","v":0},null,{"$f":"K87*F87","v":0},16,{"$f":"M87*F87","v":0},null,{"$f":"O87*F87","v":0}]
[null,67,"Płyn do mycia naczyń LUDWIK Miętowy 1 l.","Posiada bardzo dobre właściwości myjące oraz wysoką zdolność do emulgowania tłuszczów zarówno w ciepłej, jak i zimnej wodzie. Nie pozostawia zacieków na umytych powierzchniach, nadaje im połysk bez konieczności wycierania do sucha. Nowa receptura została również wzbogacona kompleksem witamin A,E,F,H, mającym działanie ochronne i odżywcze dla skóry rąk, Polecany również do mycia mebli, lodówek, wykładzin, podłóg, glazury, dywanów i tworzyw sztucznych","op. (1 l)",{"$f":"IF('Załącznik 13-F.O. Zad 11-15 '!$V$57,VLOOKUP(C88,'Załącznik 13-F.O. Zad 11-15 '!$C$52:$G$174,5,0),0)","v":0},55,0,null,0,null,0,55,0,null,0]
[null,68,"Płyn do mycia naczyń LUDWIK, cytrynowy, 450 g","Posiada bardzo dobre właściwości myjące oraz wysoką zdolność do emulgowania tłuszczów zarówno w ciepłej, jak i zimnej wodzie. Nie pozostawia zacieków na umytych powierzchniach, nadaje im połysk bez konieczności wycierania do sucha. Nowa receptura została również wzbogacona kompleksem witamin A,E,F,H, mającym działanie ochronne i odżywcze dla skóry rąk, Polecany również do mycia mebli, lodówek, wykładzin, podłóg, glazury, dywanów i tworzyw sztucznych","op. (450g)",{"$f":"IF('Załącznik 13-F.O. Zad 11-15 '!$V$57,VLOOKUP(C89,'Załącznik 13-F.O. Zad 11-15 '!$C$52:$G$174,5,0),0)","v":0},33,0,null,0,null,0,33,0,null,0]
[null,69,"Płyn do naczyń LUDWIK, 450 g, miętowy"," Nie pozostawia zacieków na umytych powierzchniach, nadaje im połysk bez konieczności wycierania do sucha. Polecany również do mycia mebli, lodówek, wykładzin, podłóg, glazury, dywanów i tworzyw sztucznych.","op.(450g)",{"$f":"IF('Załącznik 13-F.O. Zad 11-15 '!$V$57,VLOOKUP(C90,'Załącznik 13-F.O. Zad 11-15 '!$C$52:$G$174,5,0),0)","v":0},15,0,null,0,null,0,15,0,null,0]
[null,70,"Płyn nabłyszczający FINISH, 400 ml","Usuwa ślady po kroplach wody i osad z kamienia, pozostawiając Diamentowy Połysk Jednostka sprzedaży: 1 opakowanie (400 ml)","op. (400 ml)",{"$f":"IF('Załącznik 13-F.O. Zad 11-15 '!$V$57,VLOOKUP(C91,'Załącznik 13-F.O. Zad 11-15 '!$C$52:$G$174,5,0),0)","v":0},37,0,null,0,null,0,37,0,null,0]
[null,71,"Sól ochronna do zmywarki LUDWIK, 1,5 kg","Preparat chroniący zmywarkę przed osadzaniem się kamienia w jej wnętrzu i na mytych naczyniach Skutecznie zmiękcza wodę dzięki zastosowanej formule, preparat zawiera całkowicie rozpuszczalną szlachetną sól z granulkami o odpowiedniej wielkości Regularne stosowanie soli ochronnej Ludwik zapewnia prawidłowe funkcjonowanie zmywarki i długotrwałą ochronę jej mechanizmów Jednostka sprzedaży: 1 opakowanie (1,5 kg)","op. (1 l)",{"$f":"IF('Załącznik 13-F.O. Zad 11-15 '!$V$57,VLOOKUP(C92,'Załącznik 13-F.O. Zad 11-15 '!$C$52:$G$174,5,0),0)","v":0},3,0,null,0,null,0,3,0,null,0]
[null,72,"Sól SOMAT do zmywarek, 1,5 kg","Zabezpiecza zmywarkę oraz naczynia przed osadzaniem się kamienia Wygodna w użyciu sól ma postać granulek Opakowanie: 1,5 kg Jednostka sprzedaży: 1 sztuka ","op. (5 kg)",{"$f":"IF('Załącznik 13-F.O. Zad 11-15 '!$V$57,VLOOKUP(C93,'Załącznik 13-F.O. Zad 11-15 '!$C$52:$G$174,5,0),0)","v":0},37,0,null,0,null,0,37,0,null,0]
[null,73,"Płyn do mycia szyb i glazury LUDWIK grapefruit z octem, 750 ml","Nie pozostawia smug, zacieków i szybko odparowuje., Skład: do 5% anionowe środki powierzchniowo czynne, konserwant (2-bromo-2-nitropropane-1,3-diol, methylchloroisothiazolinone, methylisothiazolinone), kompozycja zapachowa (limonene, linalool).","op. (750ml)",{"$f":"IF('Załącznik 13-F.O. Zad 11-15 '!$V$57,VLOOKUP(C94,'Załącznik 13-F.O. Zad 11-15 '!$C$52:$G$174,5,0),0)","v":0},12,0,null,0,null,0,12,0,null,0]
[null,74,"Płyn do mycia szyb KUBUŚ z atomizerem, 1 l","Przeznaczony do mycia szyb okiennych, luster oraz innych powierzchni szklanych, Doskonale usuwa brud, nie pozostawia smug","op. (1 l)",{"$f":"IF('Załącznik 13-F.O. Zad 11-15 '!$V$57,VLOOKUP(C95,'Załącznik 13-F.O. Zad 11-15 '!$C$52:$G$174,5,0),0)","v":0},3,0,null,0,null,0,3,0,null,0]
[null,75,"Mleczko do czyszczenia CIF Regular Cream, 650 ml/780 g","Uniwersalne mleczko CIF z mikrokryształkami, które pomaga utrzymać powierzchnie w czystości, jest delikatne i nie rysuje powierzchni. Usuwa najbardziej oporny brud taki jak: przypieczony tłuszcz, przypalone jedzenie, plamy z kamienia w łazience. Składniki: do 5% anionowe środki powierzchniowo, czynne niejonowe środki powierzchniowo czynne, mydło, kompozycja zapachowa Limonene, Benzisothiazolinone, Linalool, Butylphenyl Methylpropional, Hexyl Cinnamal. Sposób użycia: nanieść na wilgotną ściereczkę lub bezpośrednio na czyszczoną powierzchnię. Po wyczyszczeniu dokładnie spłukać. Nie połykać. Mleczko do czyszczenia powierzchni twardych.","op (650 ml)",{"$f":"IF('Załącznik 13-F.O. Zad 11-15 '!$V$57,VLOOKUP(C96,'Załącznik 13-F.O. Zad 11-15 '!$C$52:$G$174,5,0),0)","v":0},22,0,null,0,6,0,16,0,null,0]
[null,76,"Czajnik elektryczny TEFAL Express 1,5 l, biały","Czajnik z ukrytym elementem grzejnym i obrotową podstawą, Filtr antywapienny i dwustronny wskaźnik poziomu wody, Możliwość zagotowania minimalnej ilości wody (250 ml), Pojemność: 1,5 l","szt.",{"$f":"IF('Załącznik 13-F.O. Zad 11-15 '!$V$57,VLOOKUP(C97,'Załącznik 13-F.O. Zad 11-15 '!$C$52:$G$174,5,0),0)","v":0},7,0,1,0,6,0,0,0,null,0]
[null,77,"Reklamówki foliowe 9 micronów 210 + 2 x 60 x 435 mm (+/-12), 150 sztuk","Reklamówki o wymiarach 210 + 2 x 60 x 435 mm (+/-12) Nawój: 150 sztuk\nFolia HDPE / grubość 9 mikronówJednostka sprzedaży: 1 rolka (150sztuk)\n","op. (150 szt.)",{"$f":"IF('Załącznik 13-F.O. Zad 11-15 '!$V$57,VLOOKUP(C98,'Załącznik 13-F.O. Zad 11-15 '!$C$52:$G$174,5,0),0)","v":0},6,0,null,0,null,0,6,0,null,0]
[null,78,"Worki do segregacji 60 l, niebieskie na papier, 60 x 72 cm","Wytrzymałe worki ułatwiające segregację śmieci dzięki kodowi kolorystycznemu, Mają nadruk informujący, jakie typy odpadów należy do nich wrzucać, a jakich nie należy, Wymiary: 60 x 72 cm","op. (10 worków)",{"$f":"IF('Załącznik 13-F.O. Zad 11-15 '!$V$57,VLOOKUP(C99,'Załącznik 13-F.O. Zad 11-15 '!$C$52:$G$174,5,0),0)","v":0},40,0,null,0,30,0,10,0,null,0]
[null,79,"Worki na śmieci LDPE sanitarne 120 l, niebieskie, 10 sztuk","Wymiary: 110 x 70 cm, Grubość: folii: 0,03 mm","op (10 szt)",{"$f":"IF('Załącznik 13-F.O. Zad 11-15 '!$V$57,VLOOKUP(C100,'Załącznik 13-F.O. Zad 11-15 '!$C$52:$G$174,5,0),0)","v":0},48,0,null,0,30,0,18,0,null,0]
[null,80,"Worki na śmieci LDPE sanitarne 160 l, czarne, 20 sztuk","Worki na śmieci LDPE sanitarne 160 l, czarne, 20 sztuk Pojemność: 160 l Wymiary: 150 x 90 cm Grubość: folii: 0,027 mm Kolor folii: czarny Jednostka sprzedaży: 1 opakowanie (20 sztuk)","op. (20 sztuk)",{"$f":"IF('Załącznik 13-F.O. Zad 11-15 '!$V$57,VLOOKUP(C101,'Załącznik 13-F.O. Zad 11-15 '!$C$52:$G$174,5,0),0)","v":0},33,0,null,0,30,0,3,0,null,0]
[null,81,"Worki na śmieci LDPE z taśmą ściągającą 60 l, czarne, 10 sztuk","Posiadają taśmę ściągającą Pojemność: 60 l Wymiary: 72 x 60 cm Grubość: folii: 0,02 mm Kolor folii: czarny Jednostka sprzedaży: 1 opakowanie (10 sztuk)","op. (10 sztuk)",{"$f":"IF('Załącznik 13-F.O. Zad 11-15 '!$V$57,VLOOKUP(C102,'Załącznik 13-F.O. Zad 11-15 '!$C$52:$G$174,5,0),0)","v":0},9,0,null,0,null,0,9,0,null,0]
[null,82,"Worki na śmieci MDPE 35 l, niebieskie 20 sztuk","Pojemność: 35 l Wymiary: 58 x 49 cm Grubość: folii: 0,011 mm Kolor folii: niebieski Jednostka sprzedaży: 1 opakowanie (20 sztuk)","op. (20 sztuk)",{"$f":"IF('Załącznik 13-F.O. Zad 11-15 '!$V$57,VLOOKUP(C103,'Załącznik 13-F.O. Zad 11-15 '!$C$52:$G$174,5,0),0)","v":0},15,0,null,0,null,0,15,0,null,0]
[null,null,null,null,null,null,{"$f":"SUM(G22:G103)","v":1890},null,{"$f":"SUM(I22:I103)","v":15},null,{"$f":"SUM(K22:K103)","v":904},null,{"$f":"SUM(M22:M103)","v":968},null,{"$f":"SUM(O22:O103)","v":3}]
[null,null,null,null,null,null,null,null,"ŁĄCZNA CENA NETTO DLA ENEA Centrum Sp. z o.o. ",{"$f":"SUM(J22:J103)","v":0},"ŁĄCZNA CENA NETTO DLA ENEA Innowacje sp. z o.o. ",{"$f":"SUM(L22:L103)","v":0},"ŁĄCZNA CENA NETTO DLA ENEA S.A.",{"$f":"SUM(N14:N103)","v":0},"ŁĄCZNA CENA NETTO DLA ENEA Trading Sp. z o.o.",{"$f":"SUM(P22:P103)","v":0}]
[]
[]
[]
[null,null,"miejscowość i data",null,null,"Pieczęć imienna i podpis przedstawiciela(i) Wykonawcy"]

{"sheet":"Załącznik17-F.O. dla Zadanie 14","index":8,"n_rows":81,"n_cols":16,"rows_kept":81,"cut":false,"hidden":false,"merged":[[2,1,2,7],[4,1,4,7],[8,1,8,7],[11,1,11,7],[14,1,14,7],[18,1,18,2],[79,2,79,3],[79,4,79,7],[80,5,80,7],[16,1,16,7]]}
[null,"Oznaczenie sprawy:  1400/DW00/ZU/KZ/2022/0000079539"]
[]
[null,"ZAŁĄCZNIK NR 17 - FORMULARZ OFERTY DLA ZADANIA 14 - DOSTAWA ARTYKUŁÓW HIGIENICZNYCH: WARSZAWA + ŚWIERŻE GÓRNE + WOJ. MAZOWIECKIE"]
[]
[]
[null,null,"(pieczęć wykonawcy)"]
[]
[null,"Ja, niżej podpisany (My niżej podpisani):"]
[]
[]
[null,"działając w imieniu i na rzecz:"]
[]
[]
[null,"Składam(y) ofertę na wykonanie zamówienia, którego przedmiotem jest:"]
[null,"Dostawa artykułów biurowych, spożywczych i higienicznych dla spółek GK ENEA"]
[]
[null,"ZADANIE 14 - Dostawa artykułów higienicznych: Warszawa + Świerże Górne + woj. Mazowieckie"]
[]
[null,"ŁĄCZNA CENA NETTO OFERTY DLA ZADANIA 14:",null,{"$f":"SUM(H22:H75)","v":0}]
[]
[null,"LP","Nazwa produktu","Opis szczegółowy","Jednostka ","cena jednostkowa netto","Ilość","Wartość","ENEA Centrum Sp. z o.o. - Szacowana ilość","ŁĄCZNA CENA NETTO DLA ENEA Centrum Sp. z o.o. ","Enea Innowacje sp.z o.o. - Szacowana ilość","ŁĄCZNA CENA NETTO DLA ENEA Innowacje sp. z o.o.","ENEA S.A. - Szacowana ilość","ŁĄCZNA CENA NETTO DLA ENEA S.A.","ENEA Elkogaz Sp.zo.o. - Szacowana ilość","ŁĄCZNA CENA NETTO DLA ENEA Elkogaz Sp.zo.o."]
[null,1,"Odkamieniacz KAMIX, w proszku, 150 g","Środek do usuwania osadów z kamienia Pojemność: 150 g Jednostka sprzedaży: 1 opakowanie ","op. ( 150 g)",{"$f":"IF('Załącznik 13-F.O. Zad 11-15 '!$V$58,VLOOKUP(C22,'Załącznik 13-F.O. Zad 11-15 '!$C$52:$G$174,5,0),0)","v":0},{"$f":"I22+K22+M22+O22","v":13},{"$f":"G22*F22","v":0},1,{"$f":"I22*F22","v":0},10,{"$f":"K22*F22","v":0},null,{"$f":"M22*F22","v":0},2,{"$f":"F22*O22","v":0}]
[null,2,"Odkamieniacz uniwersalny KAMIX, w płynie, 500 ml","Środek w płynie do usuwania osadów kamienia Pojemność: 500 ml Jednostka sprzedaży: 1 opakowanie ","op. (500 ml)",{"$f":"IF('Załącznik 13-F.O. Zad 11-15 '!$V$58,VLOOKUP(C23,'Załącznik 13-F.O. Zad 11-15 '!$C$52:$G$174,5,0),0)","v":0},{"$f":"I23+K23+M23+O23","v":12},{"$f":"G23*F23","v":0},null,{"$f":"I23*F23","v":0},10,{"$f":"K23*F23","v":0},null,{"$f":"M23*F23","v":0},2,{"$f":"F23*O23","v":0}]
[null,3,"Tabletki do zmywarek FINISH All-in-1, 50 tabletek","Jego unikalna formuła łączy w sobie działanie 10 funkcji Power Actions: usuwanie zaplamień, usuwanie tłuszczu, namaczanie, usuwanie zabrudzeń po herbacie, kryształowy połyski, lśniące sztućce, ochrona przed osadzaniem się kamienia w zmywarce, aktywna ochrona szkła, ochrona srebra, usuwanie opornych zabrudzeń, Dodatkowo spełnia funkcje soli i płynu nabłyszczającego, Składniki: 5 - 15 % związki wybielające na bazie tlenu, niejonowe środki powierzchniowo czynne, do 5 % polikarboksylany, fosfoniany. Enzymy (subtylizyna, amylaza), kompozycja zapachowa.","op (50 szt)",{"$f":"IF('Załącznik 13-F.O. Zad 11-15 '!$V$58,VLOOKUP(C24,'Załącznik 13-F.O. Zad 11-15 '!$C$52:$G$174,5,0),0)","v":0},17,0,null,0,15,0,null,0,2,0]
[null,4,"Apteczka VERA TOP 15 PLUS, DIN 13157, w walizce z ABS","Apteczka w walizce z tworzywa ABS. Zawiera stelaż mocujący do ściany W skład wyposażenia wchodzą: kompres zimny – 1 szt., kompres na oko – 2 szt., kompres 10 x 10 cm - 3 opakowania (po 2 sztuki) opaska elastyczna 4 m x 6 cm – 2 szt., opaska elastyczna 4 m x 8 cm – 2 szt., zestaw plastrów 10 x 6 cm (8 szt.) – 1 komplet, zestaw plastrów (14 szt.) – 1 komplet, plaster 5 m x 2,5 cm – 1 szt., opatrunek indywidualny M sterylny – 3 szt. opatrunek indywidualny G sterylny – 1 szt., opatrunek indywidualny K sterylny – 1 szt., chusta opatrunkowa 60 x 80 cm – 1 szt. chusta trójkątna – 1 szt., chusta z flizeliny (5 szt.) – 1 komplet, koc ratunkowy 160 x 210 cm – 1 szt. nożyczki 19 cm – 1 szt., rękawice winylowe – 4 szt. chusteczka dezynfekująca – 6 sztuk, ustnik do sztucznego oddychania – 1 szt., instrukcja udzielania pierwszej pomocy Skład zgodny z normą DIN 13157. Rozmiar: 330 x 235 x 125 mm Jednostka sprzedaży: 1 sztuka","szt",{"$f":"IF('Załącznik 13-F.O. Zad 11-15 '!$V$58,VLOOKUP(C25,'Załącznik 13-F.O. Zad 11-15 '!$C$52:$G$174,5,0),0)","v":0},7,0,1,0,null,0,3,0,3,0]
[null,5,"Wyposażenie apteczki DIN 13157 PLUS","Czajnik posiada filtr antywapienny, który zapobiega przedostawaniu się kamienia do szklanki, Pojemność: 1,7 l Moc: 2400 W","op",{"$f":"IF('Załącznik 13-F.O. Zad 11-15 '!$V$58,VLOOKUP(C26,'Załącznik 13-F.O. Zad 11-15 '!$C$52:$G$174,5,0),0)","v":0},2,0,1,0,null,0,1,0,null,0]
[null,6,"Chusteczki KATRIN Plus, 100 sztuk","Białe, dwuwarstwowe chusteczki higieniczne w praktycznym podajniku Testowane dermatologicznie Jednostka sprzedaży: 1 opakowanie (100 sztuk) ","op (100 szt)",{"$f":"IF('Załącznik 13-F.O. Zad 11-15 '!$V$58,VLOOKUP(C27,'Załącznik 13-F.O. Zad 11-15 '!$C$52:$G$174,5,0),0)","v":0},30,0,null,0,20,0,10,0,null,0]
[null,7,"Czajnik elektryczny TEFAL Express 1,5 l, biały","Filtr antywapienny i dwustronny wskaźnik poziomu wody, Możliwość zagotowania minimalnej ilości wody (250 ml), Pojemność: 1,5 l, Moc: 2400 W","szt",{"$f":"IF('Załącznik 13-F.O. Zad 11-15 '!$V$58,VLOOKUP(C28,'Załącznik 13-F.O. Zad 11-15 '!$C$52:$G$174,5,0),0)","v":0},3,0,1,0,null,0,2,0,null,0]
[null,8,"Czajnik elektryczny TEFAL Loft, 1,7 l, czarny","Zdejmowana pokrywa ułatwia napełnianie wodą, Czajnik posiada filtr antywapienny, który zapobiega przedostawaniu się kamienia do szklanki, Pojemność: 1,7 l, Moc: 2400 W","szt",{"$f":"IF('Załącznik 13-F.O. Zad 11-15 '!$V$58,VLOOKUP(C29,'Załącznik 13-F.O. Zad 11-15 '!$C$52:$G$174,5,0),0)","v":0},3,0,null,0,null,0,2,0,1,0]
[null,9,"Ściereczki gąbczaste niebieskie, 3 sztuki","Bardzo trwałe i chłonne ścierki gąbczaste, wzmocnione wewnętrzną bawełnianą siatką, Najlepsze do wycierania wody, zmywania powierzchni i usuwania brudu","op. (3 szt)",{"$f":"IF('Załącznik 13-F.O. Zad 11-15 '!$V$58,VLOOKUP(C30,'Załącznik 13-F.O. Zad 11-15 '!$C$52:$G$174,5,0),0)","v":0},13,0,3,0,null,0,null,0,10,0]
[null,10,"Chusteczki FELLOWES do czyszczenia ekranów, opakowanie 100szt","Chusteczki FELLOWES do czyszczenia ekranów, opakowanie 100szt","op (100 szt)",{"$f":"IF('Załącznik 13-F.O. Zad 11-15 '!$V$58,VLOOKUP(C31,'Załącznik 13-F.O. Zad 11-15 '!$C$52:$G$174,5,0),0)","v":0},3,0,2,0,null,0,1,0,null,0]
[null,11,"Rozpuszczalnik do etykiet w sprayu, pojemność 200 ml","Produkt zapewnia w pełni bezpieczne usunięcie etykiet z dowolnej powierzchni, nie pozostawiając żadnych, śladów kleju. Pojemność 200 ml.","op (200 ml)",{"$f":"IF('Załącznik 13-F.O. Zad 11-15 '!$V$58,VLOOKUP(C32,'Załącznik 13-F.O. Zad 11-15 '!$C$52:$G$174,5,0),0)","v":0},2,0,1,0,null,0,1,0,null,0]
[null,12,"Gąbka do zmywania różowa, 5 sztuk","Gąbka do różnorodnych zastosowań, Kolor: różowy","op (5 szt)",{"$f":"IF('Załącznik 13-F.O. Zad 11-15 '!$V$58,VLOOKUP(C33,'Załącznik 13-F.O. Zad 11-15 '!$C$52:$G$174,5,0),0)","v":0},33,0,3,0,20,0,null,0,10,0]
[null,13,"Gąbki do zmywania standardowa, 5 sztuk","Do zmywania naczyń, szkła, ceramiki, powierzchni emaliowanych Wytrzymała Miks kolorów w opakowaniu Jednostka sprzedaży: 1 opakowanie (5 sztuk) Opakowanie zbiorcze: 18 opakowań","op (5 szt)",{"$f":"IF('Załącznik 13-F.O. Zad 11-15 '!$V$58,VLOOKUP(C34,'Załącznik 13-F.O. Zad 11-15 '!$C$52:$G$174,5,0),0)","v":0},6,0,6,0,null,0,null,0,null,0]
[null,14,"Odświeżacz powietrza AMBI PUR, zapach kwiatowy, 300 ml","Wypełnia pomieszczenie zapachem najpiękniejszego wiosennego bukietu Pojemność: 300 ml Jednostka sprzedaży: 1 sztuka Opakowanie zbiorcze: 6 sztuk","szt",{"$f":"IF('Załącznik 13-F.O. Zad 11-15 '!$V$58,VLOOKUP(C35,'Załącznik 13-F.O. Zad 11-15 '!$C$52:$G$174,5,0),0)","v":0},2,0,null,0,null,0,2,0,null,0]
[null,15,"Odświeżacz powietrza BRISE w sprayu","Odświeżając pomieszczenia pozostawia przyjemny zapach Pojemność: 300 ml Jednostka sprzedaży: 1 sztuka ","szt.",{"$f":"IF('Załącznik 13-F.O. Zad 11-15 '!$V$58,VLOOKUP(C36,'Załącznik 13-F.O. Zad 11-15 '!$C$52:$G$174,5,0),0)","v":0},42,0,null,0,40,0,2,0,null,0]
[null,16,"Patyczki zapachowe PACHNĄCA SZAFA, Słoneczne popołudnie, 50 ml","Patyczki zapachowe PACHNĄCA SZAFA nadają przyjemny i odświeżający zapach w każdym pomieszczeniu. Odświeżać ma bardzo ładną formę eleganckich patyczków w szklanym flakoniku.","op (50 ml)",{"$f":"IF('Załącznik 13-F.O. Zad 11-15 '!$V$58,VLOOKUP(C37,'Załącznik 13-F.O. Zad 11-15 '!$C$52:$G$174,5,0),0)","v":0},5,0,null,0,null,0,null,0,5,0]
[null,17,"Papier toaletowy CLASSIC, biały, 8 rolek","Papier toaletowy CLASSIC, biały, 8 rolek Wymiary listka: szer. 100 x dł. 112 mm, Szerokość taśmy: 100 mm","op. (8 rolek)",{"$f":"IF('Załącznik 13-F.O. Zad 11-15 '!$V$58,VLOOKUP(C38,'Załącznik 13-F.O. Zad 11-15 '!$C$52:$G$174,5,0),0)","v":0},180,0,null,0,180,0,null,0,null,0]
[null,18,"Papier toaletowy KATRIN 11296 PLUS 160, biały, 8 rolek","Papier toaletowy KATRIN 11296 PLUS 160, biały, 8 rolek Gramatura: 2 x 16,5 g/m², Długość jednej rolki: 18,3 m","op. (8 rolek)",{"$f":"IF('Załącznik 13-F.O. Zad 11-15 '!$V$58,VLOOKUP(C39,'Załącznik 13-F.O. Zad 11-15 '!$C$52:$G$174,5,0),0)","v":0},180,0,null,0,180,0,null,0,null,0]
[null,19,"Supermocny Plaster do cięcia VISCOPLAST, 1 m x 8 cm","Opatrunek włókninowy o wysokiej chłonności, Plaster natychmiast przykleja się do skóry, nawet do wilgotnej, Ogranicza przywieranie opatrunku do rany","op (1m)",{"$f":"IF('Załącznik 13-F.O. Zad 11-15 '!$V$58,VLOOKUP(C40,'Załącznik 13-F.O. Zad 11-15 '!$C$52:$G$174,5,0),0)","v":0},4,0,1,0,null,0,null,0,3,0]
[null,20,"Uniwersalny zestaw plastrów 3M VISCOPLAST, 24 sztuki","Plastry z opatrunkiem do opatrywania drobnych ran i skaleczeń Hypoalergiczne i wodoodporne Przepuszczające powietrze W opakowaniu 24 plastry: plastry Minifol: 72 x 25 mm - 4 sztuki, 72 x 19 mm - 8 sztuk, 57 x 16 mm - 6 sztuk, 38x10 mm - 4 sztuki Plaster Prestopor 10 x 6 cm Plaster Prestovis Plus 10 x 6 cm Jednostka sprzedaży: 1 opakowanie","op. ( 24 szt)",{"$f":"IF('Załącznik 13-F.O. Zad 11-15 '!$V$58,VLOOKUP(C41,'Załącznik 13-F.O. Zad 11-15 '!$C$52:$G$174,5,0),0)","v":0},8,0,4,0,3,0,1,0,null,0]
[null,21,"Chusteczki higieniczne VELVET, 120 sztuk","Chusteczki higieniczne VELVET, 120 sztuk. W opakowaniu 120 sztuk, Produkt ma atest PZH, ","op (120 szt)",{"$f":"IF('Załącznik 13-F.O. Zad 11-15 '!$V$58,VLOOKUP(C42,'Załącznik 13-F.O. Zad 11-15 '!$C$52:$G$174,5,0),0)","v":0},11,0,1,0,null,0,0,0,10,0]
[null,22,"Ręcznik w roli ESTIMO 100/2, 500 listków","Wytrzymały, dwuwarstwowy ręcznik w 100% wykonany z celulozy o wysokich parametrach i pięknym designie Długość rolki: 100 m W rolce 500 odcinków o wymiarach: 20,3 x 20 cm Kolor biały Jednostka sprzedaży: 1 rolka ","op. (rolka 100 m)",{"$f":"IF('Załącznik 13-F.O. Zad 11-15 '!$V$58,VLOOKUP(C43,'Załącznik 13-F.O. Zad 11-15 '!$C$52:$G$174,5,0),0)","v":0},20,0,null,0,20,0,null,0,null,0]
[null,23,"Ręczniki papierowe białe, składka V, 20 x 200 listków","Gofrowane ręczniki w składce Kompatybilne ze standardowymi dozownikami do ręczników typu ZZ Materiał: makulatura jednowarstwowa Wymiary listka: 25 x 23 cm Gramatura: 1 x 30 g/m² Ilość bind w opakowaniu: 20 Ilość listków w bindzie: 200 Kolor: biały Jednostka sprzedaży: 1 karton (4000 listków)","op. (20 x 200 listków)",{"$f":"IF('Załącznik 13-F.O. Zad 11-15 '!$V$58,VLOOKUP(C44,'Załącznik 13-F.O. Zad 11-15 '!$C$52:$G$174,5,0),0)","v":0},37,0,1,0,36,0,null,0,null,0]
[null,24,"Ręczniki papierowe MERIDA składka V, 20 x 160 listków","Gofrowane ręczniki w składce wysokiej chłonności Kompatybilne ze standardowymi dozownikami do ręczników typu ZZ Materiał: makulatura dwuwarstwowa Wymiary listka: 25 x 23 cm Gramatura:2 x 19 g/m² Tłoczenie: nie Ilość bind w opakowaniu: 20 Ilość listków w bindzie: 160 Kolor: biały Jednostka sprzedaży: 1 karton (3200 listków)","op. (20 x 160 listków)",{"$f":"IF('Załącznik 13-F.O. Zad 11-15 '!$V$58,VLOOKUP(C45,'Załącznik 13-F.O. Zad 11-15 '!$C$52:$G$174,5,0),0)","v":0},1,0,1,0,null,0,null,0,null,0]
[null,25,"Ręczniki w roli TORK UNIVERSAL Extra Długie do systemu TORK Matic H1, 6 rolek","Materiał: makulatura jednowarstwowa, Tłoczenie: nie, Ilość listków:1120, Długość roli: 280 m; wysokość roli: 21 cm; średnica roli: 19 cm; średnica gilzy: 3,8 cm","op. (6 rolek)",{"$f":"IF('Załącznik 13-F.O. Zad 11-15 '!$V$58,VLOOKUP(C46,'Załącznik 13-F.O. Zad 11-15 '!$C$52:$G$174,5,0),0)","v":0},10,0,10,0,null,0,null,0,null,0]
[null,26,"Rękawice antystatyczne ANSELL HyFlex® 11-800, rozmiar 9, para","Nylonowe rękawice z powłoką z pianki nitrylowej, wykonane w technologii KnitZonz™ Wszechstronne rozwiązanie do precyzyjnego montażu i prac ogólnych Zaawansowana technologia dziania zapewnia większą rozciągliwość i elastyczność w miejscach o zwiększonym nacisku Antystatyczne, zgodne z normą EN 1149 Norma EN 388 3131 (EN 388:2016 3131A) Rozmiar: 9 Jednostka sprzedaży: 1 para ","op. (1 para)",{"$f":"IF('Załącznik 13-F.O. Zad 11-15 '!$V$58,VLOOKUP(C47,'Załącznik 13-F.O. Zad 11-15 '!$C$52:$G$174,5,0),0)","v":0},3,0,3,0,null,0,null,0,null,0]
[null,27,"Ręcznik papierowy BRATEK biały, 2 rolki","Ręczniki kuchenne, dwuwarstwowe, celulozowe Szerokość rolki: 22 cm Długość rolki: 11 m Jednostka sprzedaży: 1 opakowanie (2 sztuki)","op (2 rolki)",{"$f":"IF('Załącznik 13-F.O. Zad 11-15 '!$V$58,VLOOKUP(C48,'Załącznik 13-F.O. Zad 11-15 '!$C$52:$G$174,5,0),0)","v":0},24,0,24,0,null,0,null,0,null,0]
[null,28,"Ręczniki kuchenne AHA, 2 rolki","Dwuwarstwowy ręcznik wykonany z czystej celulozy W rolce 50 odcinków o wymiarach: 23 x 20 cm W opakowaniu: 2 rolki Kolor biały Jednostka sprzedaży: 1 opakowanie ","op (2 rolki)",{"$f":"IF('Załącznik 13-F.O. Zad 11-15 '!$V$58,VLOOKUP(C49,'Załącznik 13-F.O. Zad 11-15 '!$C$52:$G$174,5,0),0)","v":0},100,0,null,0,null,0,null,0,100,0]
[null,29,"Ręczniki kuchenne VELVET, 2 rolki","Produkt wolny od bisfenolu A (BPA FREE), posiada atest NIZP-PZH","op. (2 rolki)",{"$f":"IF('Załącznik 13-F.O. Zad 11-15 '!$V$58,VLOOKUP(C50,'Załącznik 13-F.O. Zad 11-15 '!$C$52:$G$174,5,0),0)","v":0},10,0,9,0,null,0,1,0,null,0]
[null,30,"Łyżeczki do herbaty AMEFA Bologna, 12 sztuk","subtelne i eleganckie łyżeczki do herbaty, Sztućce polerowane, stal 18/0","op (12 szt)",{"$f":"IF('Załącznik 13-F.O. Zad 11-15 '!$V$58,VLOOKUP(C51,'Załącznik 13-F.O. Zad 11-15 '!$C$52:$G$174,5,0),0)","v":0},1,0,null,0,null,0,null,0,1,0]
[null,31,"Łyżki AMEFA Bologna, 12 sztuk","Sztućce polerowane, stal 18/0","op (12 szt)",{"$f":"IF('Załącznik 13-F.O. Zad 11-15 '!$V$58,VLOOKUP(C52,'Załącznik 13-F.O. Zad 11-15 '!$C$52:$G$174,5,0),0)","v":0},1,0,null,0,null,0,null,0,1,0]
[null,32,"Widelce AMEFA Bologna, 12 sztuk","\nSztućce polerowane, stal 18/0, ","op (12 szt)",{"$f":"IF('Załącznik 13-F.O. Zad 11-15 '!$V$58,VLOOKUP(C53,'Załącznik 13-F.O. Zad 11-15 '!$C$52:$G$174,5,0),0)","v":0},1,0,null,0,null,0,null,0,1,0]
[null,33,"Kulki do toalet BREF Power Activ, 50 g, zapach cytrynowy","Nowoczesne rozwiązanie w postaci czterech kulek na wygodnej zawieszce Czyszczą, pozostawiają przyjemny zapach i chronią przed osadzaniem się kamienia Masa netto: 50 g Jednostka sprzedaży: 1 sztuka Opakowanie zbiorcze: 10 sztuk","op. (50 g)",{"$f":"IF('Załącznik 13-F.O. Zad 11-15 '!$V$58,VLOOKUP(C54,'Załącznik 13-F.O. Zad 11-15 '!$C$52:$G$174,5,0),0)","v":0},20,0,null,0,20,0,null,0,null,0]
[null,34,"Kulki do toalet BREF Power Activ, 50 g, zapach morski","Nowoczesne rozwiązanie w postaci czterech kulek na wygodnej zawieszce Czyszczą, pozostawiają przyjemny zapach i chronią przed osadzaniem się kamienia Masa netto: 50 g Jednostka sprzedaży: 1 sztuka ","op. (50 g)",{"$f":"IF('Załącznik 13-F.O. Zad 11-15 '!$V$58,VLOOKUP(C55,'Załącznik 13-F.O. Zad 11-15 '!$C$52:$G$174,5,0),0)","v":0},20,0,null,0,20,0,null,0,null,0]
[null,35,"Płyn CILIT Bang Kamień i brud, 750 ml","Żel CILIT kamień i brud z Turbo Power. Do czyszczenia wanien, kabin prysznicowych, płytek, toalet, armatury kuchennej i łazienkowej Usuwa kamień, rdzawe zacieki z twardej wody, osad z mydła i inne zabrudzenia Pojemność: 750 ml Jednostka sprzedaży: 1 sztuka","op. (750 ml)",{"$f":"IF('Załącznik 13-F.O. Zad 11-15 '!$V$58,VLOOKUP(C56,'Załącznik 13-F.O. Zad 11-15 '!$C$52:$G$174,5,0),0)","v":0},1,0,null,0,1,0,null,0,null,0]
[null,36,"Płyn do toalet DOMESTOS Toilet Limescale Remover, 750 ml","Gęsty płyn do czyszczenia muszli klozetowych Formuła ściśle przylegająca do czyszczonych powierzchni, rozpuszcza kamień wapienny Przeznaczony do powierzchni porcelanowych i szkliwionych Butelka z wygodnym dozownikiem Pojemność: 750 ml Jednostka sprzedaży: 1 sztuka Opakowanie zbiorcze: 6 sztuk","op. (750 ml)",{"$f":"IF('Załącznik 13-F.O. Zad 11-15 '!$V$58,VLOOKUP(C57,'Załącznik 13-F.O. Zad 11-15 '!$C$52:$G$174,5,0),0)","v":0},2,0,null,0,2,0,null,0,null,0]
[null,37,"Płyn do WC DOMESTOS 24H, 1,25 l, cytrynowy","Produkt czyszcząco-dezynfekująco-wybielający Możliwość stosowania do: muszli klozetowych, umywalek, zlewów itp. Produkt nadaje się także do wybielania tkanin Jednostka sprzedaży: 1 sztuka Pojemność: 1,25 l ","op. (1,25 l)",{"$f":"IF('Załącznik 13-F.O. Zad 11-15 '!$V$58,VLOOKUP(C58,'Załącznik 13-F.O. Zad 11-15 '!$C$52:$G$174,5,0),0)","v":0},1,0,null,0,null,0,1,0,null,0]
[null,38,"Żel CLINEX Drill do udrażniania odpływów, 1 l","Szybko rozpuszcza wszelkie stałe i organiczne zanieczyszczenia takie jak: tłuszcz, papier, wata, odpadki kuchenne, Forma żelowa pozwala na osadzanie się preparatu na ściankach rur, przedłużając proces działania, Likwiduje nieprzyjemne zapachy, Nadaje się do udrażniania rur zarówno w kuchni, jak i w łazience","op. (1 l)",{"$f":"IF('Załącznik 13-F.O. Zad 11-15 '!$V$58,VLOOKUP(C59,'Załącznik 13-F.O. Zad 11-15 '!$C$52:$G$174,5,0),0)","v":0},1,0,null,0,1,0,null,0,null,0]
[null,39,"Biobójczy płyn do dezynfekcji rąk HISKIN, 1 l","Produkt przeznaczony do codziennego stosowania przez użytkownika powszechnego. Wykazuje działanie bakteriobójcze, grzybobójcze i wirusobójcze","op. (1 l)",{"$f":"IF('Załącznik 13-F.O. Zad 11-15 '!$V$58,VLOOKUP(C60,'Załącznik 13-F.O. Zad 11-15 '!$C$52:$G$174,5,0),0)","v":0},2,0,null,0,null,0,2,0,null,0]
[null,40,"Mydło toaletowe NIVEA, 100 g","Kremowe mydło z odżywczym olejkiem migdałowym Miks zapachów Jednostka sprzedaży: 1 sztuka ","szt. (100 g)",{"$f":"IF('Załącznik 13-F.O. Zad 11-15 '!$V$58,VLOOKUP(C61,'Załącznik 13-F.O. Zad 11-15 '!$C$52:$G$174,5,0),0)","v":0},4,0,4,0,null,0,null,0,null,0]
[null,41,"Mydło w płynie MERIDA Silva, 5 l","Mydło w płynie typu „dwa w jednym”, Zawiera m.in. glukopony mające doskonałe właściwości pielęgnacyjne skóry, jak również gluadyny – roślinne proteiny, szczególnie cenne składniki pielęgnacyjne chroniące skórę i włosy","op. (5l)",{"$f":"IF('Załącznik 13-F.O. Zad 11-15 '!$V$58,VLOOKUP(C62,'Załącznik 13-F.O. Zad 11-15 '!$C$52:$G$174,5,0),0)","v":0},2,0,null,0,2,0,null,0,null,0]
[null,42,"Mydło w płynie PALMOLIVE, migdałowe, 300 ml","Dzięki naturalnemu pH nie podrażnia nawet wrażliwej skóry Zawiera kombinację substancji czyszczących i odżywczych Opakowanie z dozownikiem Pojemność 300 ml Jednostka sprzedaży: 1 sztuka Opakowanie zbiorcze: 12 sztuk","op. (300 ml)",{"$f":"IF('Załącznik 13-F.O. Zad 11-15 '!$V$58,VLOOKUP(C63,'Załącznik 13-F.O. Zad 11-15 '!$C$52:$G$174,5,0),0)","v":0},93,0,23,0,60,0,null,0,10,0]
[null,43,"Płyn do mycia naczyń LUDWIK cytrynowy, 5 kg","Posiada bardzo dobre właściwości myjące oraz wysoką zdolność do emulgowania tłuszczów zarówno w ciepłej, jak i zimnej wodzie. Nie pozostawia zacieków na umytych powierzchniach, nadaje im połysk bez konieczności wycierania do sucha. Nowa receptura została również wzbogacona kompleksem witamin A,E,F,H, mającym działanie ochronne i odżywcze dla skóry rąk, Polecany również do mycia mebli, lodówek, wykładzin, podłóg, glazury, dywanów i tworzyw sztucznych","5 kg",{"$f":"IF('Załącznik 13-F.O. Zad 11-15 '!$V$58,VLOOKUP(C64,'Załącznik 13-F.O. Zad 11-15 '!$C$52:$G$174,5,0),0)","v":0},10,0,7,0,2,0,1,0,null,0]
[null,44,"Płyn do mycia naczyń LUDWIK, cytrynowy, 450 g","Posiada bardzo dobre właściwości myjące oraz wysoką zdolność do emulgowania tłuszczów zarówno w ciepłej, jak i zimnej wodzie. Nie pozostawia zacieków na umytych powierzchniach, nadaje im połysk bez konieczności wycierania do sucha. Nowa receptura została również wzbogacona kompleksem witamin A,E,F,H, mającym działanie ochronne i odżywcze dla skóry rąk, Polecany również do mycia mebli, lodówek, wykładzin, podłóg, glazury, dywanów i tworzyw sztucznych","op. (450g)",{"$f":"IF('Załącznik 13-F.O. Zad 11-15 '!$V$58,VLOOKUP(C65,'Załącznik 13-F.O. Zad 11-15 '!$C$52:$G$174,5,0),0)","v":0},28,0,3,0,null,0,null,0,25,0]
[null,45,"Płyn do naczyń LUDWIK, 450 g, miętowy"," Nie pozostawia zacieków na umytych powierzchniach, nadaje im połysk bez konieczności wycierania do sucha. Polecany również do mycia mebli, lodówek, wykładzin, podłóg, glazury, dywanów i tworzyw sztucznych.","op.(450g)",{"$f":"IF('Załącznik 13-F.O. Zad 11-15 '!$V$58,VLOOKUP(C66,'Załącznik 13-F.O. Zad 11-15 '!$C$52:$G$174,5,0),0)","v":0},5,0,5,0,null,0,null,0,null,0]
[null,46,"Płyn nabłyszczający FINISH, 400 ml","Usuwa ślady po kroplach wody i osad z kamienia, pozostawiając Diamentowy Połysk Jednostka sprzedaży: 1 opakowanie (400 ml)","op. (400 ml)",{"$f":"IF('Załącznik 13-F.O. Zad 11-15 '!$V$58,VLOOKUP(C67,'Załącznik 13-F.O. Zad 11-15 '!$C$52:$G$174,5,0),0)","v":0},4,0,null,0,4,0,null,0,null,0]
[null,47,"Sól SOMAT do zmywarek, 1,5 kg","Zabezpiecza zmywarkę oraz naczynia przed osadzaniem się kamienia Wygodna w użyciu sól ma postać granulek Opakowanie: 1,5 kg Jednostka sprzedaży: 1 sztuka ","op. (5 kg)",{"$f":"IF('Załącznik 13-F.O. Zad 11-15 '!$V$58,VLOOKUP(C68,'Załącznik 13-F.O. Zad 11-15 '!$C$52:$G$174,5,0),0)","v":0},1,0,null,0,null,0,null,0,1,0]
[null,48,"Płyn do szyb i luster BUZIL G522 Profiglass, 600 ml","Gotowy do użycia środek do mycia szyb i luster Skutecznie usuwa zabrudzenia, również te tłuste\nButelka posiada specjalnie przyciętą końcówkę rozpryskującą, która ułatwia nanoszenie środka czyszczącego Wygodna butelka 600 ml ze spryskiwaczem","op (600 ml)",{"$f":"IF('Załącznik 13-F.O. Zad 11-15 '!$V$58,VLOOKUP(C69,'Załącznik 13-F.O. Zad 11-15 '!$C$52:$G$174,5,0),0)","v":0},2,0,null,0,2,0,null,0,null,0]
[null,49,"Mleczko do czyszczenia CIF Regular Cream, 650 ml/780 g","Uniwersalne mleczko CIF z mikrokryształkami, które pomaga utrzymać powierzchnie w czystości, jest delikatne i nie rysuje powierzchni. Usuwa najbardziej oporny brud taki jak: przypieczony tłuszcz, przypalone jedzenie, plamy z kamienia w łazience. Składniki: do 5% anionowe środki powierzchniowo, czynne niejonowe środki powierzchniowo czynne, mydło, kompozycja zapachowa Limonene, Benzisothiazolinone, Linalool, Butylphenyl Methylpropional, Hexyl Cinnamal. Sposób użycia: nanieść na wilgotną ściereczkę lub bezpośrednio na czyszczoną powierzchnię. Po wyczyszczeniu dokładnie spłukać. Nie połykać. Mleczko do czyszczenia powierzchni twardych.","op (650 ml)",{"$f":"IF('Załącznik 13-F.O. Zad 11-15 '!$V$58,VLOOKUP(C70,'Załącznik 13-F.O. Zad 11-15 '!$C$52:$G$174,5,0),0)","v":0},2,0,null,0,2,0,null,0,null,0]
[null,50,"Czajnik elektryczny TEFAL Express 1,5 l, biały","Czajnik z ukrytym elementem grzejnym i obrotową podstawą, Filtr antywapienny i dwustronny wskaźnik poziomu wody, Możliwość zagotowania minimalnej ilości wody (250 ml), Pojemność: 1,5 l","szt.",{"$f":"IF('Załącznik 13-F.O. Zad 11-15 '!$V$58,VLOOKUP(C71,'Załącznik 13-F.O. Zad 11-15 '!$C$52:$G$174,5,0),0)","v":0},1,0,1,0,null,0,null,0,null,0]
[null,51,"Worki na śmieci LDPE sanitarne 120 l, niebieskie, 10 sztuk","Wymiary: 110 x 70 cm, Grubość: folii: 0,03 mm","op (10 szt)",{"$f":"IF('Załącznik 13-F.O. Zad 11-15 '!$V$58,VLOOKUP(C72,'Załącznik 13-F.O. Zad 11-15 '!$C$52:$G$174,5,0),0)","v":0},5,0,null,0,null,0,null,0,5,0]
[null,52,"Worki na śmieci LDPE sanitarne 160 l, czarne, 20 sztuk","Worki na śmieci LDPE sanitarne 160 l, czarne, 20 sztuk Pojemność: 160 l Wymiary: 150 x 90 cm Grubość: folii: 0,027 mm Kolor folii: czarny Jednostka sprzedaży: 1 opakowanie (20 sztuk)","op. (20 sztuk)",{"$f":"IF('Załącznik 13-F.O. Zad 11-15 '!$V$58,VLOOKUP(C73,'Załącznik 13-F.O. Zad 11-15 '!$C$52:$G$174,5,0),0)","v":0},5,0,null,0,5,0,null,0,null,0]
[null,53,"Worki na śmieci LDPE z taśmą ściągającą 60 l, czarne, 10 sztuk","Posiadają taśmę ściągającą Pojemność: 60 l Wymiary: 72 x 60 cm Grubość: folii: 0,02 mm Kolor folii: czarny Jednostka sprzedaży: 1 opakowanie (10 sztuk)","op. (10 sztuk)",{"$f":"IF('Załącznik 13-F.O. Zad 11-15 '!$V$58,VLOOKUP(C74,'Załącznik 13-F.O. Zad 11-15 '!$C$52:$G$174,5,0),0)","v":0},5,0,null,0,5,0,null,0,null,0]
[null,54,"Worki na śmieci MDPE 35 l, niebieskie 20 sztuk","Pojemność: 35 l Wymiary: 58 x 49 cm Grubość: folii: 0,011 mm Kolor folii: niebieski Jednostka sprzedaży: 1 opakowanie (20 sztuk)","op. (20 sztuk)",{"$f":"IF('Załącznik 13-F.O. Zad 11-15 '!$V$58,VLOOKUP(C75,'Załącznik 13-F.O. Zad 11-15 '!$C$52:$G$174,5,0),0)","v":0},5,0,null,0,5,0,null,0,null,0]
[null,null,null,null,null,null,{"$f":"SUM(G22:G75)","v":1003},null,{"$f":"SUM(I22:I75)","v":116},null,{"$f":"SUM(K22:K75)","v":665},null,{"$f":"SUM(M22:M75)","v":30},null,{"$f":"SUM(O22:O75)","v":192}]
[null,null,null,null,null,null,null,null,"ŁĄCZNA CENA NETTO DLA ENEA Centrum Sp. z o.o. ",{"$f":"SUM(J22:J75)","v":0},"ŁĄCZNA CENA NETTO DLA ENEA Innowacje sp. z o.o. ",{"$f":"SUM(L22:L75)","v":0},"ŁĄCZNA CENA NETTO DLA ENEA S.A.",{"$f":"SUM(N22:N75)","v":0},"ŁĄCZNA CENA NETTO DLA ENEA Elkogaz Sp.zo.o.",{"$f":"SUM(P22:P75)","v":0}]
[]
[]
[]
[null,null,"miejscowość i data",null,null,"Pieczęć imienna i podpis przedstawiciela(i) Wykonawcy"]

{"sheet":"Załącznik18-F.O. dla Zadania 15","index":9,"n_rows":150,"n_cols":16,"rows_kept":150,"cut":false,"hidden":false,"merged":[[2,1,2,7],[4,1,4,7],[8,1,8,7],[11,1,11,7],[14,1,14,7],[18,1,18,2],[148,2,148,3],[148,4,148,7],[149,5,149,7],[16,1,16,7]]}
[null,"Oznaczenie sprawy:  1400/DW00/ZU/KZ/2022/0000079539"]
[]
[null,"ZAŁĄCZNIK NR 18 - FORMULARZ OFERTY DLA ZADANIA 15 - DOSTAWA ARTYKUŁÓW HIGIENICZNYCH: POŁANIEC"]
[]
[]
[null,null,"(pieczęć wykonawcy)"]
[]
[null,"Ja, niżej podpisany (My niżej podpisani):"]
[]
[]
[null,"działając w imieniu i na rzecz:"]
[]
[]
[null,"Składam(y) ofertę na wykonanie zamówienia, którego przedmiotem jest:"]
[null,"Dostawa artykułów biurowych, spożywczych i higienicznych dla spółek GK ENEA"]
[]
[null,"ZADANIE 15 - Dostawa artykułów higienicznych: Połaniec "]
[]
[null,"ŁĄCZNA CENA NETTO OFERTY DLA ZADANIA 15:",null,{"$f":"SUM(H22:H143)","v":0}]
[]
[null,"LP","Nazwa produktu","Opis szczegółowy","Jednostka ","cena jednostkowa netto","Ilość","Wartość","ENEA Centrum Sp. z o.o. - Szacowana ilość","ŁĄCZNA CENA NETTO DLA ENEA Centrum Sp. z o.o. ","Enea Bioenergia sp.z o.o. - Szacowana ilość","ŁĄCZNA CENA NETTO DLA ENEA Bioenergia sp. z o.o.","ENEA Elektrownia Połaniec Sp. z o.o. - Szacowana ilość","ŁĄCZNA CENA NETTO DLA ENEA Elektrownia Połaniec Sp. z o.o. ","ENEA Połaniec Serwis Sp. z o.o. - Szacowana ilość","ŁĄCZNA CENA NETTO DLA ENEA Połaniec Serwis Sp. z o.o. "]
[null,1,"Filtr do expresu DELONGHI 45.76X","Filtr do expresu DELONGHI 45.76X","szt",{"$f":"IF('Załącznik 13-F.O. Zad 11-15 '!$V$59,VLOOKUP(C22,'Załącznik 13-F.O. Zad 11-15 '!$C$52:$G$174,5,0),0)","v":0},{"$f":"I22+K22+M22+O22","v":15},{"$f":"G22*F22","v":0},null,{"$f":"I22*F22","v":0},5,{"$f":"K22*F22","v":0},10,{"$f":"M22*F22","v":0},null,{"$f":"O22*F22","v":0}]
[null,2,"ODKAMIENIACZ DO EKSPRESU MELITTA 250ML","odkamieniacz do  ekspresu MELITA poj. 250 ml.","szt. (250 ml)",{"$f":"IF('Załącznik 13-F.O. Zad 11-15 '!$V$59,VLOOKUP(C23,'Załącznik 13-F.O. Zad 11-15 '!$C$52:$G$174,5,0),0)","v":0},{"$f":"I23+K23+M23+O23","v":5},{"$f":"G23*F23","v":0},null,{"$f":"I23*F23","v":0},5,{"$f":"K23*F23","v":0},0,{"$f":"M23*F23","v":0},null,{"$f":"O23*F23","v":0}]
[null,3,"Odkamieniacz KAMIX, w proszku, 150 g","Środek do usuwania osadów z kamienia Pojemność: 150 g Jednostka sprzedaży: 1 opakowanie ","op. ( 150 g)",{"$f":"IF('Załącznik 13-F.O. Zad 11-15 '!$V$59,VLOOKUP(C24,'Załącznik 13-F.O. Zad 11-15 '!$C$52:$G$174,5,0),0)","v":0},55,0,null,0,5,0,50,0,null,0]
[null,4,"Odkamieniacz uniwersalny KAMIX, w płynie, 500 ml","Środek w płynie do usuwania osadów kamienia Pojemność: 500 ml Jednostka sprzedaży: 1 opakowanie ","op. (500 ml)",{"$f":"IF('Załącznik 13-F.O. Zad 11-15 '!$V$59,VLOOKUP(C25,'Załącznik 13-F.O. Zad 11-15 '!$C$52:$G$174,5,0),0)","v":0},25,0,null,0,5,0,20,0,null,0]
[null,5,"Tabletki do czyszczenia sekcji mlecznej ekspresu","Tabletki do codziennego czyszczenia sekcji mlecznej zapewniają dokładne i higieniczne użytkowanie sekcji mlecznej Jednostka sprzedaży: 1 opakowanie","op. ( 62 szt )",{"$f":"IF('Załącznik 13-F.O. Zad 11-15 '!$V$59,VLOOKUP(C26,'Załącznik 13-F.O. Zad 11-15 '!$C$52:$G$174,5,0),0)","v":0},17,0,null,0,5,0,12,0,null,0]
[null,6,"Płyn odkamieniający DELONGHI \"EcoDecalk\"","odkamieniacz do  ekspresu DELONGHI ","szt.   ",{"$f":"IF('Załącznik 13-F.O. Zad 11-15 '!$V$59,VLOOKUP(C27,'Załącznik 13-F.O. Zad 11-15 '!$C$52:$G$174,5,0),0)","v":0},15,0,null,0,5,0,10,0,null,0]
[null,7,"Tabletki czyszczące KRUPS XS3000, 10 sztuk","Tabletki czyszczące przeznaczone do ekspresów ciśnieniowych i przelewowych Usuwają tłuszcz i pozostałości po kawie wewnątrz ekspresu. Regularne stosowanie gwarantuje utrzymanie wysokiej jakości kawy Jednostka sprzedaży: 1 opakowanie (10 sztuk)","op (10 szt)",{"$f":"IF('Załącznik 13-F.O. Zad 11-15 '!$V$59,VLOOKUP(C28,'Załącznik 13-F.O. Zad 11-15 '!$C$52:$G$174,5,0),0)","v":0},15,0,null,0,5,0,10,0,null,0]
[null,8,"Tabletki do zmywarek FINISH All-in-1, 50 tabletek","Jego unikalna formuła łączy w sobie działanie 10 funkcji Power Actions: usuwanie zaplamień, usuwanie tłuszczu, namaczanie, usuwanie zabrudzeń po herbacie, kryształowy połyski, lśniące sztućce, ochrona przed osadzaniem się kamienia w zmywarce, aktywna ochrona szkła, ochrona srebra, usuwanie opornych zabrudzeń, Dodatkowo spełnia funkcje soli i płynu nabłyszczającego, Składniki: 5 - 15 % związki wybielające na bazie tlenu, niejonowe środki powierzchniowo czynne, do 5 % polikarboksylany, fosfoniany. Enzymy (subtylizyna, amylaza), kompozycja zapachowa.","op (50 szt)",{"$f":"IF('Załącznik 13-F.O. Zad 11-15 '!$V$59,VLOOKUP(C29,'Załącznik 13-F.O. Zad 11-15 '!$C$52:$G$174,5,0),0)","v":0},15,0,null,0,5,0,10,0,null,0]
[null,9,"UNIWERSALNY zestaw do odkamieniania ekspresów","Uniwerslany zestaw do odkamieniania ekspresów Nespresso. Ilość sztuk w opakowaniu: 2 Jednostka sprzedaży: 1 opakowanie","op",{"$f":"IF('Załącznik 13-F.O. Zad 11-15 '!$V$59,VLOOKUP(C30,'Załącznik 13-F.O. Zad 11-15 '!$C$52:$G$174,5,0),0)","v":0},31,0,null,0,1,0,30,0,null,0]
[null,10,"Wkłady filtrujące BRITA Maxtra+ Pure Performance, 3 sztuki","Wybierając wkłady filtrujące Brita Maxtra+ Pure Performance, zapewniasz sobie czystą wodę o doskonałym smaku. Zastosowane perełki węgla aktywnego skutecznie zatrzymują chlor i redukują mogące występować w wodzie zanieczyszczenia, jak herbicydy, pestycydy czy pozostałości po farmaceutykach. Z kolei perełki wymiennika jonowego zmiękczają wodę i zmniejszają występowanie metali w rodzaju miedzi i ołowiu. Wkłady filtrując są rekomendowane do wody miękkiej i średnio twardej.","op (3 szt)",{"$f":"IF('Załącznik 13-F.O. Zad 11-15 '!$V$59,VLOOKUP(C31,'Załącznik 13-F.O. Zad 11-15 '!$C$52:$G$174,5,0),0)","v":0},1,0,null,0,1,0,0,0,null,0]
[null,11,"Worki papierowe do odkurzacza MERIDA Dex, 3 sztuki","Worki papierowe do odkurzacza MERIDA Dex, 3 sztuki","op (3 szt)",{"$f":"IF('Załącznik 13-F.O. Zad 11-15 '!$V$59,VLOOKUP(C32,'Załącznik 13-F.O. Zad 11-15 '!$C$52:$G$174,5,0),0)","v":0},1,0,null,0,1,0,0,0,null,0]
[null,12,"Wymienne wkłady do filtra wody AQUAPHOR MAXFOR","Największa na rynku wydajność - do 200 l, Zawiera innowacyjne włókno Aqualen, dzięki czemu skutecznie usuwa z wody chlor, metale ciężkie, fenol, pestycydy i inne zanieczyszczenia, Redukuje twardość wody i zapobiega pojawianiu się osadu i kamienia na urządzeniach AGD np. w czajnikach i ekspresach, Produkt wolny od bisfenolu A (BPA FREE), wykonany z ekologicznych materiałów","op (3 szt)",{"$f":"IF('Załącznik 13-F.O. Zad 11-15 '!$V$59,VLOOKUP(C33,'Załącznik 13-F.O. Zad 11-15 '!$C$52:$G$174,5,0),0)","v":0},1,0,null,0,1,0,0,0,null,0]
[null,13,"Zestaw do odkamieniania KRUPS F054, 2 saszetki po 40 g","Zestaw polecany do ekspresów KRUPS Informacje na temat sposobu użytkowania dostępne w instrukcji obsługi ekspresu W opakowaniu: 2 saszetki środka odkamieniającego Jednostka sprzedaży: 1 opakowanie (2 saszetki x 40 g)","op (2 saszetki)",{"$f":"IF('Załącznik 13-F.O. Zad 11-15 '!$V$59,VLOOKUP(C34,'Załącznik 13-F.O. Zad 11-15 '!$C$52:$G$174,5,0),0)","v":0},11,0,null,0,1,0,10,0,null,0]
[null,14,"Apteczka VERA TOP 15 PLUS, DIN 13157, w walizce z ABS","Apteczka w walizce z tworzywa ABS. Zawiera stelaż mocujący do ściany W skład wyposażenia wchodzą: kompres zimny – 1 szt., kompres na oko – 2 szt., kompres 10 x 10 cm - 3 opakowania (po 2 sztuki) opaska elastyczna 4 m x 6 cm – 2 szt., opaska elastyczna 4 m x 8 cm – 2 szt., zestaw plastrów 10 x 6 cm (8 szt.) – 1 komplet, zestaw plastrów (14 szt.) – 1 komplet, plaster 5 m x 2,5 cm – 1 szt., opatrunek indywidualny M sterylny – 3 szt. opatrunek indywidualny G sterylny – 1 szt., opatrunek indywidualny K sterylny – 1 szt., chusta opatrunkowa 60 x 80 cm – 1 szt. chusta trójkątna – 1 szt., chusta z flizeliny (5 szt.) – 1 komplet, koc ratunkowy 160 x 210 cm – 1 szt. nożyczki 19 cm – 1 szt., rękawice winylowe – 4 szt. chusteczka dezynfekująca – 6 sztuk, ustnik do sztucznego oddychania – 1 szt., instrukcja udzielania pierwszej pomocy Skład zgodny z normą DIN 13157. Rozmiar: 330 x 235 x 125 mm Jednostka sprzedaży: 1 sztuka","szt",{"$f":"IF('Załącznik 13-F.O. Zad 11-15 '!$V$59,VLOOKUP(C35,'Załącznik 13-F.O. Zad 11-15 '!$C$52:$G$174,5,0),0)","v":0},16,0,1,0,1,0,12,0,2,0]
[null,15,"Wyposażenie apteczki DIN 13157 PLUS","Czajnik posiada filtr antywapienny, który zapobiega przedostawaniu się kamienia do szklanki, Pojemność: 1,7 l Moc: 2400 W","op",{"$f":"IF('Załącznik 13-F.O. Zad 11-15 '!$V$59,VLOOKUP(C36,'Załącznik 13-F.O. Zad 11-15 '!$C$52:$G$174,5,0),0)","v":0},14,0,1,0,1,0,10,0,2,0]
[null,16,"Chusteczki KATRIN Plus, 100 sztuk","Białe, dwuwarstwowe chusteczki higieniczne w praktycznym podajniku Testowane dermatologicznie Jednostka sprzedaży: 1 opakowanie (100 sztuk) ","op (100 szt)",{"$f":"IF('Załącznik 13-F.O. Zad 11-15 '!$V$59,VLOOKUP(C37,'Załącznik 13-F.O. Zad 11-15 '!$C$52:$G$174,5,0),0)","v":0},11,0,null,0,1,0,10,0,null,0]
[null,17,"Czajnik elektryczny TEFAL Express 1,5 l, biały","Filtr antywapienny i dwustronny wskaźnik poziomu wody, Możliwość zagotowania minimalnej ilości wody (250 ml), Pojemność: 1,5 l, Moc: 2400 W","szt",{"$f":"IF('Załącznik 13-F.O. Zad 11-15 '!$V$59,VLOOKUP(C38,'Załącznik 13-F.O. Zad 11-15 '!$C$52:$G$174,5,0),0)","v":0},30,0,null,0,10,0,20,0,null,0]
[null,18,"Czajnik elektryczny TEFAL Loft, 1,7 l, czarny","Zdejmowana pokrywa ułatwia napełnianie wodą, Czajnik posiada filtr antywapienny, który zapobiega przedostawaniu się kamienia do szklanki, Pojemność: 1,7 l, Moc: 2400 W","szt",{"$f":"IF('Załącznik 13-F.O. Zad 11-15 '!$V$59,VLOOKUP(C39,'Załącznik 13-F.O. Zad 11-15 '!$C$52:$G$174,5,0),0)","v":0},30,0,null,0,5,0,20,0,5,0]
[null,19,"Czyściwo włókninowe, wielozadaniowe do trudnych zabrudzeń TORK, 1 rolka","Jednowarstwowe, grube i mocne czyściwo wielozadaniowe non-woven (syntetyczno-celulozowe) Duża chłonność, także oleistych substancji Niskopylne i odporne na rozerwania Współpracuje z rozpuszczalnikami, ograniczając ich zużycie Polecane do stosowania w przemyśle maszynowym, poligraficznym, spożywczym  nawet do najcięższych zadań związanych z czyszczeniem Atest PZH i certyfikat ISEGA, zezwalający na stosowanie produktu w przemyśle spożywczym W wygodnym kartonie mogącym służyć jako dozownik Perforacja co 38 cm Materiał: włóknina jednowarstwowa Tłoczenie: nie Ilość listków: 280  szerokość listka: 320 mm Długość roli: 106,4 m  średnica r[...]","szt",{"$f":"IF('Załącznik 13-F.O. Zad 11-15 '!$V$59,VLOOKUP(C40,'Załącznik 13-F.O. Zad 11-15 '!$C$52:$G$174,5,0),0)","v":0},21,0,null,0,1,0,10,0,10,0]
[null,20,"Kij z mopem sznurkowym, 1 komplet","Kij z mopem sznurkowym, Waga: 345 g, Jednostka sprzedaży: 1 sztuka","szt",{"$f":"IF('Załącznik 13-F.O. Zad 11-15 '!$V$59,VLOOKUP(C41,'Załącznik 13-F.O. Zad 11-15 '!$C$52:$G$174,5,0),0)","v":0},16,0,null,0,1,0,5,0,10,0]
[null,21,"Nakładka CEG z mikrofibry na mop triple, długość 40 cm","Mop trójskładnikowy DUO (kieszeń + klips), Wykonany z bawełny, mikrowłókna i poliestru, Długość: 40 cm","szt",{"$f":"IF('Załącznik 13-F.O. Zad 11-15 '!$V$59,VLOOKUP(C42,'Załącznik 13-F.O. Zad 11-15 '!$C$52:$G$174,5,0),0)","v":0},1,0,null,0,1,0,0,0,null,0]
[null,22,"Ściereczki gąbczaste niebieskie, 3 sztuki","Bardzo trwałe i chłonne ścierki gąbczaste, wzmocnione wewnętrzną bawełnianą siatką, Najlepsze do wycierania wody, zmywania powierzchni i usuwania brudu","op. (3 szt)",{"$f":"IF('Załącznik 13-F.O. Zad 11-15 '!$V$59,VLOOKUP(C43,'Załącznik 13-F.O. Zad 11-15 '!$C$52:$G$174,5,0),0)","v":0},13,0,null,0,1,0,12,0,null,0]
[null,23,"Ścierka do podłogi, 50 x 60 cm, pomarańczowa","Ścierka do podłogi, 50 x 60 cm, pomarańczowaWymiary: 50 x 60 cm, Do czyszczenia dużych powierzchni","szt",{"$f":"IF('Załącznik 13-F.O. Zad 11-15 '!$V$59,VLOOKUP(C44,'Załącznik 13-F.O. Zad 11-15 '!$C$52:$G$174,5,0),0)","v":0},21,0,null,0,1,0,10,0,10,0]
[null,24,"Ścierka z mikrofibry KOLORADO, 35 x 35 cm","Ścierka z mikrofibry przeznaczona do czyszczenia powierzchni szklanych i stosowania w łazience, Skuteczna na sucho i mokro, Nie pozostawia smug, zacieków ani kłaczków, Skład: 80% poliester, 20% poliamid (nylon)","szt",{"$f":"IF('Załącznik 13-F.O. Zad 11-15 '!$V$59,VLOOKUP(C45,'Załącznik 13-F.O. Zad 11-15 '!$C$52:$G$174,5,0),0)","v":0},21,0,null,0,1,0,10,0,10,0]
[null,25,"Ścierki uniwersalne Practi Maxi 50sztuk","Ścierki uniwersalne Practi Maxi 50sztuk rozmiar 25 x 40","op (50 szt)",{"$f":"IF('Załącznik 13-F.O. Zad 11-15 '!$V$59,VLOOKUP(C46,'Załącznik 13-F.O. Zad 11-15 '!$C$52:$G$174,5,0),0)","v":0},11,0,null,0,1,0,10,0,null,0]
[null,26,"Ścierki uniwersalne, 5 sztuk","Ścierki wielokrotnego użytku Można je prać i sterylizować Wykonane z wiskozy, pachnące Miks kolorów Wymiary: 37 x 38 cm","op (5 szt)",{"$f":"IF('Załącznik 13-F.O. Zad 11-15 '!$V$59,VLOOKUP(C47,'Załącznik 13-F.O. Zad 11-15 '!$C$52:$G$174,5,0),0)","v":0},11,0,null,0,1,0,10,0,null,0]
[null,27,"Proszek do prania tkanin kolorowych DOSIA, 300 g","Proszek do prania tkanin kolorowych do wszystkich typów pralek i do prania ręcznego\nZawiera enzymy i aktywne składniki piorące\nNie zawiera chlorowych wybielaczy: jest delikatna dla kolorowych i ciemnych tkanin\nJednostka sprzedaży: 1 sztuka (300 g)","op (300g)",{"$f":"IF('Załącznik 13-F.O. Zad 11-15 '!$V$59,VLOOKUP(C48,'Załącznik 13-F.O. Zad 11-15 '!$C$52:$G$174,5,0),0)","v":0},1,0,null,0,1,0,0,0,null,0]
[null,28,"Proszek do prania tkanin PUROX, 5 kg","Do wszystkich typów pralek i do prania ręcznego, Jednostka sprzedaży: 1 opakowanie (5 kg), Składniki: do 5% anionowe i niejonowe środki powierzchniowo czynne, enzymy, kompozycja zapachowa, krzemiany, niejonowe środki powierzchniowo, czynne, regulatory piany, rozjaśniacze optyczne, związki wybielające na bazie tlenu","op (5 kg)",{"$f":"IF('Załącznik 13-F.O. Zad 11-15 '!$V$59,VLOOKUP(C49,'Załącznik 13-F.O. Zad 11-15 '!$C$52:$G$174,5,0),0)","v":0},1,0,null,0,1,0,0,0,null,0]
[null,29,"Chusteczki FELLOWES do czyszczenia ekranów, opakowanie 100szt","Chusteczki FELLOWES do czyszczenia ekranów, opakowanie 100szt","op (100 szt)",{"$f":"IF('Załącznik 13-F.O. Zad 11-15 '!$V$59,VLOOKUP(C50,'Załącznik 13-F.O. Zad 11-15 '!$C$52:$G$174,5,0),0)","v":0},58,0,2,0,1,0,50,0,5,0]
[null,30,"Płyn AJAX Floral Fiesta, 1 l","Doskonale usuwa kurz i brud, pozostawiając na długo świeży zapach Miks zapachów Pojemność: 1 l Jednostka sprzedaży 1 sztuka","op (1l)",{"$f":"IF('Załącznik 13-F.O. Zad 11-15 '!$V$59,VLOOKUP(C51,'Załącznik 13-F.O. Zad 11-15 '!$C$52:$G$174,5,0),0)","v":0},21,0,null,0,1,0,0,0,20,0]
[null,31,"Preparat do usuwania tłustego brudu VOIGT C457 Ultra Clean plus 1 l","Odtłuszczanie, gruntowne mycie bez fosforanów – Produkt do profesjonalnego zastosowania, Nie zawierający fosforanów, Usuwa zabrudzenia pochodzenia tłuszczowego i przemysłowego m.in. oleje, smary. Zalecany do: warsztatów, hal produkcyjnych, galerii handlowych, centrów logistycznych","op (1l)",{"$f":"IF('Załącznik 13-F.O. Zad 11-15 '!$V$59,VLOOKUP(C52,'Załącznik 13-F.O. Zad 11-15 '!$C$52:$G$174,5,0),0)","v":0},1,0,null,0,1,0,0,0,null,0]
[null,32,"Rozpuszczalnik do etykiet w sprayu, pojemność 200 ml","Produkt zapewnia w pełni bezpieczne usunięcie etykiet z dowolnej powierzchni, nie pozostawiając żadnych, śladów kleju. Pojemność 200 ml.","op (200 ml)",{"$f":"IF('Załącznik 13-F.O. Zad 11-15 '!$V$59,VLOOKUP(C53,'Załącznik 13-F.O. Zad 11-15 '!$C$52:$G$174,5,0),0)","v":0},7,0,1,0,1,0,5,0,null,0]
[null,33,"Gąbka do zmywania różowa, 5 sztuk","Gąbka do różnorodnych zastosowań, Kolor: różowy","op (5 szt)",{"$f":"IF('Załącznik 13-F.O. Zad 11-15 '!$V$59,VLOOKUP(C54,'Załącznik 13-F.O. Zad 11-15 '!$C$52:$G$174,5,0),0)","v":0},21,0,null,0,1,0,0,0,20,0]
[null,34,"Gąbki do zmywania standardowa, 5 sztuk","Do zmywania naczyń, szkła, ceramiki, powierzchni emaliowanych Wytrzymała Miks kolorów w opakowaniu Jednostka sprzedaży: 1 opakowanie (5 sztuk) Opakowanie zbiorcze: 18 opakowań","op (5 szt)",{"$f":"IF('Załącznik 13-F.O. Zad 11-15 '!$V$59,VLOOKUP(C55,'Załącznik 13-F.O. Zad 11-15 '!$C$52:$G$174,5,0),0)","v":0},101,0,null,0,1,0,100,0,null,0]
[null,35,"Kuchenka mikrofalowa SEVERIN 7890/7862, biała","5 poziomów mocy, Rozmrażanie w oparciu o czas i wagę, 35-minutowy timer z sygnałem akustycznym, Pokrętło regulacyjne z chromowanymi elementami, Średnica wyjmowanego talerza ok. 25,4 cm, Wysokość komory ok. 16,5 cm, Obudowa i komora lakierowana powłoką odporną na wysokie temperatur, Wymiary: szer. 43,5, gł. 34,5, wys. 25,4 cm, Moc: 700 W","szt",{"$f":"IF('Załącznik 13-F.O. Zad 11-15 '!$V$59,VLOOKUP(C56,'Załącznik 13-F.O. Zad 11-15 '!$C$52:$G$174,5,0),0)","v":0},8,0,null,0,5,0,0,0,3,0]
[null,36,"Jednorazowa maska higieniczna 3-warstwowa, niebieska, 50 sztuk","Trójwarstwowa maska higieniczna. Wykonana z włókniny polipropylenowej (100%). Materiał: Texfil 25 (Spunbond) + Texfil 25 (Spunbond) + Texfil 25 (Spunbond). Gramatura: 25 gsm + 25 gsm + 25 gsm= 75 gsm. Gumki – długość 16cm - 18cm (± 1cm).","op (50szt)",{"$f":"IF('Załącznik 13-F.O. Zad 11-15 '!$V$59,VLOOKUP(C57,'Załącznik 13-F.O. Zad 11-15 '!$C$52:$G$174,5,0),0)","v":0},10,0,5,0,5,0,0,0,null,0]
[null,37,"Półmaska FILTERSERVICE FS-623V NR D, FFP2, z zaworem, 10 sztuk","Czasza półmaski: - Igłowana włóknina poliestrowa,  - Włóknina polipropylenowa typu melt blown, - Włóknina osłonowa, - Zawór wydechowy, - Zapinki taśm nagłowia, - Taśma nagłowia","op (10szt)",{"$f":"IF('Załącznik 13-F.O. Zad 11-15 '!$V$59,VLOOKUP(C58,'Załącznik 13-F.O. Zad 11-15 '!$C$52:$G$174,5,0),0)","v":0},5,0,null,0,5,0,0,0,null,0]
[null,38,"Nawilżacz powietrza NU 5N","4 poziomy intensywności nawilżania, Automatyczna kontrola wilgotności, Demontowany zasobnik wody 5,2 l, Funkcja jonizacji","szt",{"$f":"IF('Załącznik 13-F.O. Zad 11-15 '!$V$59,VLOOKUP(C59,'Załącznik 13-F.O. Zad 11-15 '!$C$52:$G$174,5,0),0)","v":0},5,0,null,0,5,0,0,0,null,0]
[null,39,"Odświeżacz powietrza AMBI PUR, zapach kwiatowy, 300 ml","Wypełnia pomieszczenie zapachem najpiękniejszego wiosennego bukietu Pojemność: 300 ml Jednostka sprzedaży: 1 sztuka Opakowanie zbiorcze: 6 sztuk","szt",{"$f":"IF('Załącznik 13-F.O. Zad 11-15 '!$V$59,VLOOKUP(C60,'Załącznik 13-F.O. Zad 11-15 '!$C$52:$G$174,5,0),0)","v":0},26,0,1,0,5,0,20,0,null,0]
[null,40,"Odświeżacz powietrza BRISE w sprayu","Odświeżając pomieszczenia pozostawia przyjemny zapach Pojemność: 300 ml Jednostka sprzedaży: 1 sztuka ","szt.",{"$f":"IF('Załącznik 13-F.O. Zad 11-15 '!$V$59,VLOOKUP(C61,'Załącznik 13-F.O. Zad 11-15 '!$C$52:$G$174,5,0),0)","v":0},25,0,null,0,10,0,10,0,5,0]
[null,41,"Odświeżacz powietrza BRISE w żelu, miks zapachów","Masa netto: 150 g Miks zapachów Jednostka sprzedaży: 1 sztuka ","szt.",{"$f":"IF('Załącznik 13-F.O. Zad 11-15 '!$V$59,VLOOKUP(C62,'Załącznik 13-F.O. Zad 11-15 '!$C$52:$G$174,5,0),0)","v":0},25,0,null,0,10,0,10,0,5,0]
[null,42,"Odświeżacz powietrza GREEN FRESH, 400 ml","Skutecznie neutralizuje i pochłania nieprzyjemne zapachy\nOdświeża i nawilża powietrze, pozostawiając w pomieszczeniu uczucie świeżości i czystości Pojemność: 400 ml Jednostka sprzedaży: 1 sztuka","op. (400 ml)",{"$f":"IF('Załącznik 13-F.O. Zad 11-15 '!$V$59,VLOOKUP(C63,'Załącznik 13-F.O. Zad 11-15 '!$C$52:$G$174,5,0),0)","v":0},20,0,null,0,10,0,10,0,null,0]
[null,43,"Patyczki zapachowe PACHNĄCA SZAFA, Słoneczne popołudnie, 50 ml","Patyczki zapachowe PACHNĄCA SZAFA nadają przyjemny i odświeżający zapach w każdym pomieszczeniu. Odświeżać ma bardzo ładną formę eleganckich patyczków w szklanym flakoniku.","op (50 ml)",{"$f":"IF('Załącznik 13-F.O. Zad 11-15 '!$V$59,VLOOKUP(C64,'Załącznik 13-F.O. Zad 11-15 '!$C$52:$G$174,5,0),0)","v":0},11,0,null,0,1,0,5,0,5,0]
[null,44,"Wkład do odświeżacza AMBI PUR, zapach ocean and wind","Wkład do elektrycznego odświeżacza powietrza AMBI PUR (6.630.347) Wydajność wkładów: do 80 dni Jednostka sprzedaży: 1 sztuka ","szt",{"$f":"IF('Załącznik 13-F.O. Zad 11-15 '!$V$59,VLOOKUP(C65,'Załącznik 13-F.O. Zad 11-15 '!$C$52:$G$174,5,0),0)","v":0},13,0,null,0,1,0,12,0,null,0]
[null,45,"Papier toaletowy CLASSIC, biały, 8 rolek","Papier toaletowy CLASSIC, biały, 8 rolek Wymiary listka: szer. 100 x dł. 112 mm, Szerokość taśmy: 100 mm","op. (8 rolek)",{"$f":"IF('Załącznik 13-F.O. Zad 11-15 '!$V$59,VLOOKUP(C66,'Załącznik 13-F.O. Zad 11-15 '!$C$52:$G$174,5,0),0)","v":0},6,0,null,0,1,0,0,0,5,0]
[null,46,"Papier toaletowy ELLIS PROFESSIONAL JUMBO 130/2, 12 rolek","Papier do użytku profesjonalnego w pomieszczeniach o zwiększonym natężeniu użytkowania, Materiał: celuloza dwuwarstwowa, Gramatura: 2 x 16 g/m², Długość roli: 120 m; średnica roli: 19 cm; średnica gilzy: 6 cm","op (12 rolek)",{"$f":"IF('Załącznik 13-F.O. Zad 11-15 '!$V$59,VLOOKUP(C67,'Załącznik 13-F.O. Zad 11-15 '!$C$52:$G$174,5,0),0)","v":0},41,0,null,0,1,0,0,0,40,0]
[null,47,"Papier toaletowy KATRIN 11296 PLUS 160, biały, 8 rolek","Papier toaletowy KATRIN 11296 PLUS 160, biały, 8 rolek Gramatura: 2 x 16,5 g/m², Długość jednej rolki: 18,3 m","op. (8 rolek)",{"$f":"IF('Załącznik 13-F.O. Zad 11-15 '!$V$59,VLOOKUP(C68,'Załącznik 13-F.O. Zad 11-15 '!$C$52:$G$174,5,0),0)","v":0},1,0,null,0,1,0,0,0,null,0]
[null,48,"Supermocny Plaster do cięcia VISCOPLAST, 1 m x 8 cm","Opatrunek włókninowy o wysokiej chłonności, Plaster natychmiast przykleja się do skóry, nawet do wilgotnej, Ogranicza przywieranie opatrunku do rany","op (1m)",{"$f":"IF('Załącznik 13-F.O. Zad 11-15 '!$V$59,VLOOKUP(C69,'Załącznik 13-F.O. Zad 11-15 '!$C$52:$G$174,5,0),0)","v":0},2,0,1,0,1,0,0,0,null,0]
[null,49,"Uniwersalny zestaw plastrów 3M VISCOPLAST, 24 sztuki","Plastry z opatrunkiem do opatrywania drobnych ran i skaleczeń Hypoalergiczne i wodoodporne Przepuszczające powietrze W opakowaniu 24 plastry: plastry Minifol: 72 x 25 mm - 4 sztuki, 72 x 19 mm - 8 sztuk, 57 x 16 mm - 6 sztuk, 38x10 mm - 4 sztuki Plaster Prestopor 10 x 6 cm Plaster Prestovis Plus 10 x 6 cm Jednostka sprzedaży: 1 opakowanie","op. ( 24 szt)",{"$f":"IF('Załącznik 13-F.O. Zad 11-15 '!$V$59,VLOOKUP(C70,'Załącznik 13-F.O. Zad 11-15 '!$C$52:$G$174,5,0),0)","v":0},4,0,1,0,1,0,0,0,2,0]
[null,50,"Krem do rąk EVELINE ''Niewidzialne rękawiczki'', 100 ml","Odżywczo-ochronny krem do rąk z formułą witaminową Polecany do suchych i podrażnionych dłoni Pojemność: 100 ml Jednostka sprzedaży: 1 sztuka ","op do (100 ml)",{"$f":"IF('Załącznik 13-F.O. Zad 11-15 '!$V$59,VLOOKUP(C71,'Załącznik 13-F.O. Zad 11-15 '!$C$52:$G$174,5,0),0)","v":0},21,0,null,0,1,0,20,0,null,0]
[null,51,"Krem do rąk GARNIER do skóry bardzo suchej, 100 g","Regeneruje i odżywia zniszczoną skórę dłoni Zawiera alantoinę, glicerynę oraz czynnik filtrującyJednostka sprzedaży: 1 sztuka (100 g)","op. (100 g)",{"$f":"IF('Załącznik 13-F.O. Zad 11-15 '!$V$59,VLOOKUP(C72,'Załącznik 13-F.O. Zad 11-15 '!$C$52:$G$174,5,0),0)","v":0},21,0,null,0,1,0,20,0,null,0]
[null,52,"Ręcznik MALFINI, chabrowy, 70x140 cm","Tkana metka, która może również służyć jako wieszaczek, Ozdobiony wyszywaną bordiurą po obu brzegach, Sklad: 100% bawełna, frotte, Gramatura: 450g/m², Kolor: chabrowy, Rozmiar: 70x140 cm","szt",{"$f":"IF('Załącznik 13-F.O. Zad 11-15 '!$V$59,VLOOKUP(C73,'Załącznik 13-F.O. Zad 11-15 '!$C$52:$G$174,5,0),0)","v":0},1,0,null,0,1,0,0,0,null,0]
[null,53,"Ręcznik MALFINI, granatowy, 50x100 cm","Tkana metka, która może również służyć jako wieszaczek, Ozdobiony wyszywaną bordiurą po obu brzegach, Sklad: 100% bawełna, frotte, Gramatura: 450g/m², Kolor: granatowy","szt",{"$f":"IF('Załącznik 13-F.O. Zad 11-15 '!$V$59,VLOOKUP(C74,'Załącznik 13-F.O. Zad 11-15 '!$C$52:$G$174,5,0),0)","v":0},1,0,null,0,1,0,0,0,null,0]
[null,54,"Ręcznik MALFINI, szaro-czarny, 50x100 cm","Wykonane z wysokiej jakości frotte, odpowiednie pod haft, Miękkie, miłe w dotyku, dobrze absorbują wodę, Tkana metka, która może również służyć jako wieszaczek, Ozdobiony wyszywaną bordiurą po obu brzegach, Sklad: 100% bawełna, frotte, Gramatura: 450g/m² kolor szaroczany ","szt",{"$f":"IF('Załącznik 13-F.O. Zad 11-15 '!$V$59,VLOOKUP(C75,'Załącznik 13-F.O. Zad 11-15 '!$C$52:$G$174,5,0),0)","v":0},1,0,null,0,1,0,0,0,null,0]
[null,55,"Ręcznik MALFINI, szaro-czarny, 70x140 cm","Tkana metka, która może również służyć jako wieszaczek, Ozdobiony wyszywaną bordiurą po obu brzegach, Sklad: 100% bawełna, frotte, Gramatura: 450g/m², Kolor: szaroczarny Rozmiar: 70x140 cm","szt",{"$f":"IF('Załącznik 13-F.O. Zad 11-15 '!$V$59,VLOOKUP(C76,'Załącznik 13-F.O. Zad 11-15 '!$C$52:$G$174,5,0),0)","v":0},1,0,null,0,1,0,0,0,null,0]
[null,56,"Chusteczki higieniczne VELVET, 120 sztuk","Chusteczki higieniczne VELVET, 120 sztuk. W opakowaniu 120 sztuk, Produkt ma atest PZH, ","op (120 szt)",{"$f":"IF('Załącznik 13-F.O. Zad 11-15 '!$V$59,VLOOKUP(C77,'Załącznik 13-F.O. Zad 11-15 '!$C$52:$G$174,5,0),0)","v":0},51,0,null,0,1,0,50,0,null,0]
[null,57,"Ręcznik w roli ESTIMO 100/2, 500 listków","Wytrzymały, dwuwarstwowy ręcznik w 100% wykonany z celulozy o wysokich parametrach i pięknym designie Długość rolki: 100 m W rolce 500 odcinków o wymiarach: 20,3 x 20 cm Kolor biały Jednostka sprzedaży: 1 rolka ","op. (rolka 100 m)",{"$f":"IF('Załącznik 13-F.O. Zad 11-15 '!$V$59,VLOOKUP(C78,'Załącznik 13-F.O. Zad 11-15 '!$C$52:$G$174,5,0),0)","v":0},51,0,null,0,1,0,0,0,50,0]
[null,58,"Ręczniki papierowe białe, składka V, 20 x 200 listków","Gofrowane ręczniki w składce Kompatybilne ze standardowymi dozownikami do ręczników typu ZZ Materiał: makulatura jednowarstwowa Wymiary listka: 25 x 23 cm Gramatura: 1 x 30 g/m² Ilość bind w opakowaniu: 20 Ilość listków w bindzie: 200 Kolor: biały Jednostka sprzedaży: 1 karton (4000 listków)","op. (20 x 200 listków)",{"$f":"IF('Załącznik 13-F.O. Zad 11-15 '!$V$59,VLOOKUP(C79,'Załącznik 13-F.O. Zad 11-15 '!$C$52:$G$174,5,0),0)","v":0},11,0,null,0,1,0,10,0,null,0]
[null,59,"Ręczniki papierowe MERIDA składka V, 20 x 160 listków","Gofrowane ręczniki w składce wysokiej chłonności Kompatybilne ze standardowymi dozownikami do ręczników typu ZZ Materiał: makulatura dwuwarstwowa Wymiary listka: 25 x 23 cm Gramatura:2 x 19 g/m² Tłoczenie: nie Ilość bind w opakowaniu: 20 Ilość listków w bindzie: 160 Kolor: biały Jednostka sprzedaży: 1 karton (3200 listków)","op. (20 x 160 listków)",{"$f":"IF('Załącznik 13-F.O. Zad 11-15 '!$V$59,VLOOKUP(C80,'Załącznik 13-F.O. Zad 11-15 '!$C$52:$G$174,5,0),0)","v":0},11,0,null,0,1,0,10,0,null,0]
[null,60,"Ręczniki papierowe zielone, składka V, 20 x 200 listków","Gofrowane ręczniki w składce wysokiej chłonności Kompatybilne ze standardowymi dozownikami do ręczników typu ZZ Materiał: makulatura jednowarstwowa Wymiary listka: 25 x 23 cm Gramatura:2 x 19 g/m² Tłoczenie: nie Ilość bind w opakowaniu: 20 Ilość listków w bindzie: 160 Kolor: zielon. ","op. (20 x 200 listków)",{"$f":"IF('Załącznik 13-F.O. Zad 11-15 '!$V$59,VLOOKUP(C81,'Załącznik 13-F.O. Zad 11-15 '!$C$52:$G$174,5,0),0)","v":0},1,0,null,0,1,0,0,0,null,0]
[null,61,"Ręczniki w roli TORK UNIVERSAL Extra Długie do systemu TORK Matic H1, 6 rolek","Materiał: makulatura jednowarstwowa, Tłoczenie: nie, Ilość listków:1120, Długość roli: 280 m; wysokość roli: 21 cm; średnica roli: 19 cm; średnica gilzy: 3,8 cm","op. (6 rolek)",{"$f":"IF('Załącznik 13-F.O. Zad 11-15 '!$V$59,VLOOKUP(C82,'Załącznik 13-F.O. Zad 11-15 '!$C$52:$G$174,5,0),0)","v":0},3,0,2,0,1,0,0,0,null,0]
[null,62,"Rękawice antystatyczne ANSELL HyFlex® 11-800, rozmiar 9, para","Nylonowe rękawice z powłoką z pianki nitrylowej, wykonane w technologii KnitZonz™ Wszechstronne rozwiązanie do precyzyjnego montażu i prac ogólnych Zaawansowana technologia dziania zapewnia większą rozciągliwość i elastyczność w miejscach o zwiększonym nacisku Antystatyczne, zgodne z normą EN 1149 Norma EN 388 3131 (EN 388:2016 3131A) Rozmiar: 9 Jednostka sprzedaży: 1 para ","op. (1 para)",{"$f":"IF('Załącznik 13-F.O. Zad 11-15 '!$V$59,VLOOKUP(C83,'Załącznik 13-F.O. Zad 11-15 '!$C$52:$G$174,5,0),0)","v":0},1,0,null,0,1,0,0,0,null,0]
[null,63,"Rękawice DELTAPLUS VV835 Chemsafe, rozmiar 11, para","Rękawica z podwójną powłoką nitrylową na wkładzie z poliamidu, Trzecia powłoka z szorstkiej pianki nitrylowej na stronie chwytnej i końcach palców, Długość: 35 cm, Grubość: 1,15 mm - 1,30 mm na stronie chwytnej","op, 1 (para)",{"$f":"IF('Załącznik 13-F.O. Zad 11-15 '!$V$59,VLOOKUP(C84,'Załącznik 13-F.O. Zad 11-15 '!$C$52:$G$174,5,0),0)","v":0},1,0,null,0,1,0,0,0,null,0]
[null,64,"Rękawice nitrylowe MEDASEPT PF, czarne, rozmiar S, 100 sztuk","Uniwersalne, rękawice pasujące na prawą i lewą dłoń, Nitrylowe, Tekstura na końcach palców, Rozmiar S","op. (100 szt)",{"$f":"IF('Załącznik 13-F.O. Zad 11-15 '!$V$59,VLOOKUP(C85,'Załącznik 13-F.O. Zad 11-15 '!$C$52:$G$174,5,0),0)","v":0},1,0,null,0,1,0,0,0,null,0]
[null,65,"Rękawice nitrylowe MEDASEPT PREMIER, niebieskie, rozmiar XL, 100 sztuk","Rękawice nitrylowe diagnostyczne i ochronne (kat. III), Bezpudrowe., Uniwersalny kształt pasuje na obie dłonie, Tekstura na końcach palców, Przeznaczone do kontaktu z żywnością.","op. (100 szt)",{"$f":"IF('Załącznik 13-F.O. Zad 11-15 '!$V$59,VLOOKUP(C86,'Załącznik 13-F.O. Zad 11-15 '!$C$52:$G$174,5,0),0)","v":0},1,0,null,0,1,0,0,0,null,0]
[null,66,"Rękawice nitrylowe MEDASEPT PRIME, niebieskie, rozmiar L, 100 sztuk","Rękawice nitrylowe diagnostyczne i ochronne, Bezpudrowe. Uniwersalny kształt pasuje na obie dłonie. ","op. (100 szt)",{"$f":"IF('Załącznik 13-F.O. Zad 11-15 '!$V$59,VLOOKUP(C87,'Załącznik 13-F.O. Zad 11-15 '!$C$52:$G$174,5,0),0)","v":0},{"$f":"I87+K87+M87+O87","v":1},{"$f":"G87*F87","v":0},null,{"$f":"I87*F87","v":0},1,{"$f":"K87*F87","v":0},0,{"$f":"M87*F87","v":0},null,{"$f":"O87*F87","v":0}]
[null,67,"Rękawice nitrylowe MEDASEPT PRIME, niebieskie, rozmiar M, 100 sztuk","Rękawice nitrylowe diagnostyczne i ochronne","op. (100 szt)",{"$f":"IF('Załącznik 13-F.O. Zad 11-15 '!$V$59,VLOOKUP(C88,'Załącznik 13-F.O. Zad 11-15 '!$C$52:$G$174,5,0),0)","v":0},1,0,null,0,1,0,0,0,null,0]
[null,68,"Ręcznik kuchenny VELVET Jumbo, 1 rolka","Dwuwarstwowy ręcznik papierowy, który świetnie nadaje się do generalnych porządków, prac w garażu, ogrodzie oraz w kuchni Giga rola = 13 standardowych rolek Nie tylko chłonny i wytrzymały, ale także wyjątkowo wydajny Jedna rolka zawiera aż 520 listków Wysokość rolki: 22 cm Kolor biały Jednostka sprzedaży: 1 rolka ","szt ( 1 rolka)",{"$f":"IF('Załącznik 13-F.O. Zad 11-15 '!$V$59,VLOOKUP(C89,'Załącznik 13-F.O. Zad 11-15 '!$C$52:$G$174,5,0),0)","v":0},81,0,null,0,1,0,30,0,50,0]
[null,69,"Ręcznik papierowy BRATEK biały, 2 rolki","Ręczniki kuchenne, dwuwarstwowe, celulozowe Szerokość rolki: 22 cm Długość rolki: 11 m Jednostka sprzedaży: 1 opakowanie (2 sztuki)","op (2 rolki)",{"$f":"IF('Załącznik 13-F.O. Zad 11-15 '!$V$59,VLOOKUP(C90,'Załącznik 13-F.O. Zad 11-15 '!$C$52:$G$174,5,0),0)","v":0},31,0,null,0,1,0,30,0,null,0]
[null,70,"Ręczniki kuchenne AHA, 2 rolki","Dwuwarstwowy ręcznik wykonany z czystej celulozy W rolce 50 odcinków o wymiarach: 23 x 20 cm W opakowaniu: 2 rolki Kolor biały Jednostka sprzedaży: 1 opakowanie ","op (2 rolki)",{"$f":"IF('Załącznik 13-F.O. Zad 11-15 '!$V$59,VLOOKUP(C91,'Załącznik 13-F.O. Zad 11-15 '!$C$52:$G$174,5,0),0)","v":0},31,0,null,0,1,0,30,0,null,0]
[null,71,"Ręczniki kuchenne VELVET, 2 rolki","Produkt wolny od bisfenolu A (BPA FREE), posiada atest NIZP-PZH","op. (2 rolki)",{"$f":"IF('Załącznik 13-F.O. Zad 11-15 '!$V$59,VLOOKUP(C92,'Załącznik 13-F.O. Zad 11-15 '!$C$52:$G$174,5,0),0)","v":0},103,0,2,0,1,0,50,0,50,0]
[null,72,"Łyżeczki do herbaty AMEFA Bologna, 12 sztuk","subtelne i eleganckie łyżeczki do herbaty, Sztućce polerowane, stal 18/0","op (12 szt)",{"$f":"IF('Załącznik 13-F.O. Zad 11-15 '!$V$59,VLOOKUP(C93,'Załącznik 13-F.O. Zad 11-15 '!$C$52:$G$174,5,0),0)","v":0},123,0,null,0,1,0,120,0,2,0]
[null,73,"Łyżeczki do kawy AMEFA Bologna, 12 sztuk","Klasyczne, proste w formie, subtelne i eleganckie łyżeczki do kawy Dobra jakość w atrakcyjnej cenie powodują, iż linia od lat cieszy się wyjątkową popularnością  Sztućce polerowane, stal 18/0","op (12 szt)",{"$f":"IF('Załącznik 13-F.O. Zad 11-15 '!$V$59,VLOOKUP(C94,'Załącznik 13-F.O. Zad 11-15 '!$C$52:$G$174,5,0),0)","v":0},1,0,null,0,1,0,0,0,null,0]
[null,74,"Łyżki AMEFA Bologna, 12 sztuk","Sztućce polerowane, stal 18/0","op (12 szt)",{"$f":"IF('Załącznik 13-F.O. Zad 11-15 '!$V$59,VLOOKUP(C95,'Załącznik 13-F.O. Zad 11-15 '!$C$52:$G$174,5,0),0)","v":0},49,0,null,0,1,0,48,0,null,0]
[null,75,"Widelce AMEFA Bologna, 12 sztuk","\nSztućce polerowane, stal 18/0, ","op (12 szt)",{"$f":"IF('Załącznik 13-F.O. Zad 11-15 '!$V$59,VLOOKUP(C96,'Załącznik 13-F.O. Zad 11-15 '!$C$52:$G$174,5,0),0)","v":0},49,0,null,0,1,0,48,0,null,0]
[null,76,"Ściereczki mokre do mebli drewnianych PRESTO, opakowanie 72 sztuki","Ściereczki nawilżane do czyszczenia różnych powierzchni, Usuwają kurz i zapobiegają jego osadzaniu, Nadają połysk czyszczonym powierzchniom","op. (72 szt)",{"$f":"IF('Załącznik 13-F.O. Zad 11-15 '!$V$59,VLOOKUP(C97,'Załącznik 13-F.O. Zad 11-15 '!$C$52:$G$174,5,0),0)","v":0},1,0,null,0,1,0,0,0,null,0]
[null,77,"Kulki do toalet BREF Power Activ, 50 g, zapach cytrynowy","Nowoczesne rozwiązanie w postaci czterech kulek na wygodnej zawieszce Czyszczą, pozostawiają przyjemny zapach i chronią przed osadzaniem się kamienia Masa netto: 50 g Jednostka sprzedaży: 1 sztuka Opakowanie zbiorcze: 10 sztuk","op. (50 g)",{"$f":"IF('Załącznik 13-F.O. Zad 11-15 '!$V$59,VLOOKUP(C98,'Załącznik 13-F.O. Zad 11-15 '!$C$52:$G$174,5,0),0)","v":0},1,0,null,0,1,0,0,0,null,0]
[null,78,"Kulki do toalet BREF Power Activ, 50 g, zapach morski","Nowoczesne rozwiązanie w postaci czterech kulek na wygodnej zawieszce Czyszczą, pozostawiają przyjemny zapach i chronią przed osadzaniem się kamienia Masa netto: 50 g Jednostka sprzedaży: 1 sztuka ","op. (50 g)",{"$f":"IF('Załącznik 13-F.O. Zad 11-15 '!$V$59,VLOOKUP(C99,'Załącznik 13-F.O. Zad 11-15 '!$C$52:$G$174,5,0),0)","v":0},1,0,null,0,1,0,0,0,null,0]
[null,79,"Płyn CILIT Bang Kamień i brud, 750 ml","Żel CILIT kamień i brud z Turbo Power. Do czyszczenia wanien, kabin prysznicowych, płytek, toalet, armatury kuchennej i łazienkowej Usuwa kamień, rdzawe zacieki z twardej wody, osad z mydła i inne zabrudzenia Pojemność: 750 ml Jednostka sprzedaży: 1 sztuka","op. (750 ml)",{"$f":"IF('Załącznik 13-F.O. Zad 11-15 '!$V$59,VLOOKUP(C100,'Załącznik 13-F.O. Zad 11-15 '!$C$52:$G$174,5,0),0)","v":0},1,0,null,0,1,0,0,0,null,0]
[null,80,"Płyn do toalet DOMESTOS Toilet Limescale Remover, 750 ml","Gęsty płyn do czyszczenia muszli klozetowych Formuła ściśle przylegająca do czyszczonych powierzchni, rozpuszcza kamień wapienny Przeznaczony do powierzchni porcelanowych i szkliwionych Butelka z wygodnym dozownikiem Pojemność: 750 ml Jednostka sprzedaży: 1 sztuka Opakowanie zbiorcze: 6 sztuk","op. (750 ml)",{"$f":"IF('Załącznik 13-F.O. Zad 11-15 '!$V$59,VLOOKUP(C101,'Załącznik 13-F.O. Zad 11-15 '!$C$52:$G$174,5,0),0)","v":0},1,0,null,0,1,0,0,0,null,0]
[null,81,"Płyn do WC DOMESTOS 24H, 1,25 l, cytrynowy","Produkt czyszcząco-dezynfekująco-wybielający Możliwość stosowania do: muszli klozetowych, umywalek, zlewów itp. Produkt nadaje się także do wybielania tkanin Jednostka sprzedaży: 1 sztuka Pojemność: 1,25 l ","op. (1,25 l)",{"$f":"IF('Załącznik 13-F.O. Zad 11-15 '!$V$59,VLOOKUP(C102,'Załącznik 13-F.O. Zad 11-15 '!$C$52:$G$174,5,0),0)","v":0},1,0,null,0,1,0,0,0,null,0]
[null,82,"Płyn do WC DOMESTOS 24H, 1,25 l, leśny","Produkt czyszcząco-dezynfekująco-wybielający Możliwość stosowania do: muszli klozetowych, umywalek, zlewów itp. Produkt nadaje się także do wybielania tkanin Pojemność: 1,25 l Jednostka sprzedaży: 1 sztuka ","op. (1,25 l)",{"$f":"IF('Załącznik 13-F.O. Zad 11-15 '!$V$59,VLOOKUP(C103,'Załącznik 13-F.O. Zad 11-15 '!$C$52:$G$174,5,0),0)","v":0},1,0,null,0,1,0,0,0,null,0]
[null,83,"Wkład zapachowy do pisuarów MERIDA, czerwony","Winylowy, elastyczny wkład zapachowy do pisuarów, Zapach utrzymuje się przez około 30 dni, Dodatkowo wkład zabezpiecza pisuar przed zapchaniem","szt.",{"$f":"IF('Załącznik 13-F.O. Zad 11-15 '!$V$59,VLOOKUP(C104,'Załącznik 13-F.O. Zad 11-15 '!$C$52:$G$174,5,0),0)","v":0},1,0,null,0,1,0,0,0,null,0]
[null,84,"Zawieszka do WC DOMESTOS, zapach leśny","Zawieszki czyszczące do toalet Chronią przed osadzaniem się kamienia i pozostawiają świeży zapach Jednostka sprzedaży 1 sztuka ","szt",{"$f":"IF('Załącznik 13-F.O. Zad 11-15 '!$V$59,VLOOKUP(C105,'Załącznik 13-F.O. Zad 11-15 '!$C$52:$G$174,5,0),0)","v":0},1,0,null,0,1,0,0,0,null,0]
[null,85,"Żel BREF do WC Fresh Mist, 700 ml","Usuwa kamień, brud i osad, Gęsta formuła żelu sprawia, że działa on również pod powierzchnią wody.","op. (700 ml)",{"$f":"IF('Załącznik 13-F.O. Zad 11-15 '!$V$59,VLOOKUP(C106,'Załącznik 13-F.O. Zad 11-15 '!$C$52:$G$174,5,0),0)","v":0},1,0,null,0,1,0,0,0,null,0]
[null,86,"Żel CLINEX Drill do udrażniania odpływów, 1 l","Szybko rozpuszcza wszelkie stałe i organiczne zanieczyszczenia takie jak: tłuszcz, papier, wata, odpadki kuchenne, Forma żelowa pozwala na osadzanie się preparatu na ściankach rur, przedłużając proces działania, Likwiduje nieprzyjemne zapachy, Nadaje się do udrażniania rur zarówno w kuchni, jak i w łazience","op. (1 l)",{"$f":"IF('Załącznik 13-F.O. Zad 11-15 '!$V$59,VLOOKUP(C107,'Załącznik 13-F.O. Zad 11-15 '!$C$52:$G$174,5,0),0)","v":0},1,0,null,0,1,0,0,0,null,0]
[null,87,"Biobójczy płyn do dezynfekcji rąk HISKIN, 1 l","Produkt przeznaczony do codziennego stosowania przez użytkownika powszechnego. Wykazuje działanie bakteriobójcze, grzybobójcze i wirusobójcze","op. (1 l)",{"$f":"IF('Załącznik 13-F.O. Zad 11-15 '!$V$59,VLOOKUP(C108,'Załącznik 13-F.O. Zad 11-15 '!$C$52:$G$174,5,0),0)","v":0},1,0,null,0,1,0,null,0,null,0]
[null,88,"Dozownik do mydła w płynie MERIDA TOP, biały","Mocny i trwały dozownik do mydła w płynie wykonany z tworzywa ABS Okienko umożliwiające kontrolę zużycia mydła Pojemność: 0,8 l Zestaw do montażu w komplecie Wymiary: dł. 11,5 x szer.11,5 x wys. 25 cm Kolor: biały Jednostka sprzedaży: 1 sztuka","szt.",{"$f":"IF('Załącznik 13-F.O. Zad 11-15 '!$V$59,VLOOKUP(C109,'Załącznik 13-F.O. Zad 11-15 '!$C$52:$G$174,5,0),0)","v":0},11,0,null,0,1,0,0,0,10,0]
[null,89,"Mydło toaletowe NIVEA, 100 g","Kremowe mydło z odżywczym olejkiem migdałowym Miks zapachów Jednostka sprzedaży: 1 sztuka ","szt. (100 g)",{"$f":"IF('Załącznik 13-F.O. Zad 11-15 '!$V$59,VLOOKUP(C110,'Załącznik 13-F.O. Zad 11-15 '!$C$52:$G$174,5,0),0)","v":0},1,0,null,0,1,0,0,0,null,0]
[null,90,"Mydło w płynie MERIDA Silva, 5 l","Mydło w płynie typu „dwa w jednym”, Zawiera m.in. glukopony mające doskonałe właściwości pielęgnacyjne skóry, jak również gluadyny – roślinne proteiny, szczególnie cenne składniki pielęgnacyjne chroniące skórę i włosy","op. (5l)",{"$f":"IF('Załącznik 13-F.O. Zad 11-15 '!$V$59,VLOOKUP(C111,'Załącznik 13-F.O. Zad 11-15 '!$C$52:$G$174,5,0),0)","v":0},1,0,null,0,1,0,0,0,null,0]
[null,91,"Mydło w płynie PALMOLIVE, migdałowe, 300 ml","Dzięki naturalnemu pH nie podrażnia nawet wrażliwej skóry Zawiera kombinację substancji czyszczących i odżywczych Opakowanie z dozownikiem Pojemność 300 ml Jednostka sprzedaży: 1 sztuka Opakowanie zbiorcze: 12 sztuk","op. (300 ml)",{"$f":"IF('Załącznik 13-F.O. Zad 11-15 '!$V$59,VLOOKUP(C112,'Załącznik 13-F.O. Zad 11-15 '!$C$52:$G$174,5,0),0)","v":0},51,0,null,0,1,0,0,0,50,0]
[null,92,"Pasta BHP do rąk, ścierna, 500 g","Usuwa silne zabrudzenia smarami, tłuszczami, sadzami","op. (500g)",{"$f":"IF('Załącznik 13-F.O. Zad 11-15 '!$V$59,VLOOKUP(C113,'Załącznik 13-F.O. Zad 11-15 '!$C$52:$G$174,5,0),0)","v":0},6,0,null,0,1,0,0,0,5,0]
[null,93,"Pasta do rąk MERIDA PA12, 500 ml","Usuwa wszelkie zabrudzenia nawet powstałe od smarów i olejów, Oszczędna w użyciu, Jest niealkaliczna i nie zawiera mineralnych środków ściernych","op. (500 ml)",{"$f":"IF('Załącznik 13-F.O. Zad 11-15 '!$V$59,VLOOKUP(C114,'Załącznik 13-F.O. Zad 11-15 '!$C$52:$G$174,5,0),0)","v":0},1,0,null,0,1,0,0,0,null,0]
[null,94,"Kapsułki do zmywarek FAIRY Jar All in 1, 115 kapsułek","Wydajne kapsułki do maszynowego mycia naczyń Jednostka sprzedaży: 1 opakowanie (115 kapsułek) ","op. ( 115 szt)",{"$f":"IF('Załącznik 13-F.O. Zad 11-15 '!$V$59,VLOOKUP(C115,'Załącznik 13-F.O. Zad 11-15 '!$C$52:$G$174,5,0),0)","v":0},11,0,null,0,1,0,10,0,null,0]
[null,95,"Płyn do czyszczenia zmywarek FINISH, 250 ml","Płyn do czyszczenia zmywarek o zapachu cytrynowym Pojemność: 250 ml Jednostka sprzedaży 1 opakowanie","op (250 ml)",{"$f":"IF('Załącznik 13-F.O. Zad 11-15 '!$V$59,VLOOKUP(C116,'Załącznik 13-F.O. Zad 11-15 '!$C$52:$G$174,5,0),0)","v":0},31,0,null,0,1,0,30,0,null,0]
[null,96,"Płyn do mycia naczyń LUDWIK 1150 g","Posiada bardzo dobre właściwości myjące oraz wysoką zdolność do emulgowania tłuszczów zarówno w ciepłej, jak i zimnej wodzie. Nie pozostawia zacieków na umytych powierzchniach, nadaje im połysk bez konieczności wycierania do sucha. Nowa receptura została również wzbogacona kompleksem witamin A,E,F,H, mającym działanie ochronne i odżywcze dla skóry rąk, Polecany również do mycia mebli, lodówek, wykładzin, podłóg, glazury, dywanów i tworzyw sztucznych","op. (1150 g)",{"$f":"IF('Załącznik 13-F.O. Zad 11-15 '!$V$59,VLOOKUP(C117,'Załącznik 13-F.O. Zad 11-15 '!$C$52:$G$174,5,0),0)","v":0},10,0,null,0,10,0,0,0,null,0]
[null,97,"Płyn do mycia naczyń LUDWIK cytrynowy, 5 kg","Posiada bardzo dobre właściwości myjące oraz wysoką zdolność do emulgowania tłuszczów zarówno w ciepłej, jak i zimnej wodzie. Nie pozostawia zacieków na umytych powierzchniach, nadaje im połysk bez konieczności wycierania do sucha. Nowa receptura została również wzbogacona kompleksem witamin A,E,F,H, mającym działanie ochronne i odżywcze dla skóry rąk, Polecany również do mycia mebli, lodówek, wykładzin, podłóg, glazury, dywanów i tworzyw sztucznych","5 kg",{"$f":"IF('Załącznik 13-F.O. Zad 11-15 '!$V$59,VLOOKUP(C118,'Załącznik 13-F.O. Zad 11-15 '!$C$52:$G$174,5,0),0)","v":0},55,0,null,0,5,0,50,0,null,0]
[null,98,"Płyn do mycia naczyń LUDWIK Miętowy 1 l.","Posiada bardzo dobre właściwości myjące oraz wysoką zdolność do emulgowania tłuszczów zarówno w ciepłej, jak i zimnej wodzie. Nie pozostawia zacieków na umytych powierzchniach, nadaje im połysk bez konieczności wycierania do sucha. Nowa receptura została również wzbogacona kompleksem witamin A,E,F,H, mającym działanie ochronne i odżywcze dla skóry rąk, Polecany również do mycia mebli, lodówek, wykładzin, podłóg, glazury, dywanów i tworzyw sztucznych","op. (1 l)",{"$f":"IF('Załącznik 13-F.O. Zad 11-15 '!$V$59,VLOOKUP(C119,'Załącznik 13-F.O. Zad 11-15 '!$C$52:$G$174,5,0),0)","v":0},35,0,null,0,5,0,30,0,null,0]
[null,99,"Płyn do mycia naczyń LUDWIK, cytrynowy, 450 g","Posiada bardzo dobre właściwości myjące oraz wysoką zdolność do emulgowania tłuszczów zarówno w ciepłej, jak i zimnej wodzie. Nie pozostawia zacieków na umytych powierzchniach, nadaje im połysk bez konieczności wycierania do sucha. Nowa receptura została również wzbogacona kompleksem witamin A,E,F,H, mającym działanie ochronne i odżywcze dla skóry rąk, Polecany również do mycia mebli, lodówek, wykładzin, podłóg, glazury, dywanów i tworzyw sztucznych","op. (450g)",{"$f":"IF('Załącznik 13-F.O. Zad 11-15 '!$V$59,VLOOKUP(C120,'Załącznik 13-F.O. Zad 11-15 '!$C$52:$G$174,5,0),0)","v":0},65,0,null,0,5,0,50,0,10,0]
[null,100,"Płyn do naczyń LUDWIK, 450 g, miętowy"," Nie pozostawia zacieków na umytych powierzchniach, nadaje im połysk bez konieczności wycierania do sucha. Polecany również do mycia mebli, lodówek, wykładzin, podłóg, glazury, dywanów i tworzyw sztucznych.","op.(450g)",{"$f":"IF('Załącznik 13-F.O. Zad 11-15 '!$V$59,VLOOKUP(C121,'Załącznik 13-F.O. Zad 11-15 '!$C$52:$G$174,5,0),0)","v":0},61,0,null,0,1,0,50,0,10,0]
[null,101,"Płyn nabłyszczający do zmywarek LUDWIK, 750 ml","Przeznaczony do płukania i nabłyszczania naczyń zmywanych w zmywarce Dzięki właściwie dobranym składnikom i zawartości kwasku cytrynowego płyn sprawia, że myte naczynia wysychają bez plam i zacieków Jednostka sprzedaży: 1 opakowanie (750 ml)","op. (750 ml)",{"$f":"IF('Załącznik 13-F.O. Zad 11-15 '!$V$59,VLOOKUP(C122,'Załącznik 13-F.O. Zad 11-15 '!$C$52:$G$174,5,0),0)","v":0},1,0,null,0,1,0,0,0,null,0]
[null,102,"Płyn nabłyszczający FINISH, 400 ml","Usuwa ślady po kroplach wody i osad z kamienia, pozostawiając Diamentowy Połysk Jednostka sprzedaży: 1 opakowanie (400 ml)","op. (400 ml)",{"$f":"IF('Załącznik 13-F.O. Zad 11-15 '!$V$59,VLOOKUP(C123,'Załącznik 13-F.O. Zad 11-15 '!$C$52:$G$174,5,0),0)","v":0},31,0,null,0,1,0,30,0,null,0]
[null,103,"Sól ochronna do zmywarki LUDWIK, 1,5 kg","Preparat chroniący zmywarkę przed osadzaniem się kamienia w jej wnętrzu i na mytych naczyniach Skutecznie zmiękcza wodę dzięki zastosowanej formule, preparat zawiera całkowicie rozpuszczalną szlachetną sól z granulkami o odpowiedniej wielkości Regularne stosowanie soli ochronnej Ludwik zapewnia prawidłowe funkcjonowanie zmywarki i długotrwałą ochronę jej mechanizmów Jednostka sprzedaży: 1 opakowanie (1,5 kg)","op. (1 l)",{"$f":"IF('Załącznik 13-F.O. Zad 11-15 '!$V$59,VLOOKUP(C124,'Załącznik 13-F.O. Zad 11-15 '!$C$52:$G$174,5,0),0)","v":0},31,0,null,0,1,0,30,0,null,0]
[null,104,"Sól SOMAT do zmywarek, 1,5 kg","Zabezpiecza zmywarkę oraz naczynia przed osadzaniem się kamienia Wygodna w użyciu sól ma postać granulek Opakowanie: 1,5 kg Jednostka sprzedaży: 1 sztuka ","op. (5 kg)",{"$f":"IF('Załącznik 13-F.O. Zad 11-15 '!$V$59,VLOOKUP(C125,'Załącznik 13-F.O. Zad 11-15 '!$C$52:$G$174,5,0),0)","v":0},21,0,null,0,1,0,20,0,null,0]
[null,105,"Tabletki do zmywarek LUDWIK, 30 sztuk","Wielofunkcyjne tabletki czyszczą, nabłyszczają, chronią szkło i stal nierdzewną przed matowieniem oraz zabezpieczają zmywarkę przed osadzaniem się kamienia Funkcja zmiękczania wody pozwala na jeszcze bardziej efektywne wykorzystanie składników myjących Enzymy są aktywne już w 30°C Cytrusowy aromat tabletek nadaje długotrwały zapach świeżości w kuchni Zapewniają oszczędność wody i energii Jednostka sprzedaży: 1 opakowanie ( 30 tabletek)","op. (30 szt)",{"$f":"IF('Załącznik 13-F.O. Zad 11-15 '!$V$59,VLOOKUP(C126,'Załącznik 13-F.O. Zad 11-15 '!$C$52:$G$174,5,0),0)","v":0},1,0,null,0,1,0,0,0,null,0]
[null,106,"Płyn do mycia szyb i glazury LUDWIK grapefruit z octem, 750 ml","Nie pozostawia smug, zacieków i szybko odparowuje., Skład: do 5% anionowe środki powierzchniowo czynne, konserwant (2-bromo-2-nitropropane-1,3-diol, methylchloroisothiazolinone, methylisothiazolinone), kompozycja zapachowa (limonene, linalool).","op. (750ml)",{"$f":"IF('Załącznik 13-F.O. Zad 11-15 '!$V$59,VLOOKUP(C127,'Załącznik 13-F.O. Zad 11-15 '!$C$52:$G$174,5,0),0)","v":0},16,0,null,0,1,0,5,0,10,0]
[null,107,"Płyn do mycia szyb KUBUŚ z atomizerem, 1 l","Przeznaczony do mycia szyb okiennych, luster oraz innych powierzchni szklanych, Doskonale usuwa brud, nie pozostawia smug","op. (1 l)",{"$f":"IF('Załącznik 13-F.O. Zad 11-15 '!$V$59,VLOOKUP(C128,'Załącznik 13-F.O. Zad 11-15 '!$C$52:$G$174,5,0),0)","v":0},7,0,null,0,2,0,0,0,5,0]
[null,108,"Płyn do szyb i luster BUZIL G522 Profiglass, 600 ml","Gotowy do użycia środek do mycia szyb i luster Skutecznie usuwa zabrudzenia, również te tłuste\nButelka posiada specjalnie przyciętą końcówkę rozpryskującą, która ułatwia nanoszenie środka czyszczącego Wygodna butelka 600 ml ze spryskiwaczem","op (600 ml)",{"$f":"IF('Załącznik 13-F.O. Zad 11-15 '!$V$59,VLOOKUP(C129,'Załącznik 13-F.O. Zad 11-15 '!$C$52:$G$174,5,0),0)","v":0},1,0,null,0,1,0,0,0,null,0]
[null,109,"Mleczko do czyszczenia CIF Regular Cream, 650 ml/780 g","Uniwersalne mleczko CIF z mikrokryształkami, które pomaga utrzymać powierzchnie w czystości, jest delikatne i nie rysuje powierzchni. Usuwa najbardziej oporny brud taki jak: przypieczony tłuszcz, przypalone jedzenie, plamy z kamienia w łazience. Składniki: do 5% anionowe środki powierzchniowo, czynne niejonowe środki powierzchniowo czynne, mydło, kompozycja zapachowa Limonene, Benzisothiazolinone, Linalool, Butylphenyl Methylpropional, Hexyl Cinnamal. Sposób użycia: nanieść na wilgotną ściereczkę lub bezpośrednio na czyszczoną powierzchnię. Po wyczyszczeniu dokładnie spłukać. Nie połykać. Mleczko do czyszczenia powierzchni twardych.","op (650 ml)",{"$f":"IF('Załącznik 13-F.O. Zad 11-15 '!$V$59,VLOOKUP(C130,'Załącznik 13-F.O. Zad 11-15 '!$C$52:$G$174,5,0),0)","v":0},6,0,null,0,1,0,0,0,5,0]
[null,110,"Czajnik elektryczny TEFAL Express 1,5 l, biały","Czajnik z ukrytym elementem grzejnym i obrotową podstawą, Filtr antywapienny i dwustronny wskaźnik poziomu wody, Możliwość zagotowania minimalnej ilości wody (250 ml), Pojemność: 1,5 l","szt.",{"$f":"IF('Załącznik 13-F.O. Zad 11-15 '!$V$59,VLOOKUP(C131,'Załącznik 13-F.O. Zad 11-15 '!$C$52:$G$174,5,0),0)","v":0},27,0,1,0,1,0,20,0,5,0]
[null,111,"Dzbanek filtrujący wodę AQUAPHOR Onyx 4,2 l + 3 wkłady filtrujące, biały","Klasyczny i elegancki kształt pasuje do biur i sal konferencyjnych, Produkt wolny od bisfenolu A (BPA FREE), posiada atest NIZP-PZH, W zestawie 3 wkłady Maxfor MG wzbogacające wodę w magnez","op. (1 szt dzbanek + 3 szt. filtrów)",{"$f":"IF('Załącznik 13-F.O. Zad 11-15 '!$V$59,VLOOKUP(C132,'Załącznik 13-F.O. Zad 11-15 '!$C$52:$G$174,5,0),0)","v":0},1,0,null,0,1,0,0,0,null,0]
[null,112,"Filtr wody KRUPS F08801 do ekspresu ciśnieniowego, 1 sztuka","Zapobiega nadmiernemu osadzaniu się kamienia Dostosowany do ekspresów Krups Artese oraz Krups Orchestro Jednostka sprzedaży: 1 sztuka","szt",{"$f":"IF('Załącznik 13-F.O. Zad 11-15 '!$V$59,VLOOKUP(C133,'Załącznik 13-F.O. Zad 11-15 '!$C$52:$G$174,5,0),0)","v":0},11,0,null,0,1,0,10,0,null,0]
[null,113,"Termos TEFAL Campo, 1 l, czarny","Termos TEFAL Campo, 1 l, czarnyObudowa ze stali nierdzewnej z kolorową powłoką z wkładką szklaną, Kolor: czarny","szt",{"$f":"IF('Załącznik 13-F.O. Zad 11-15 '!$V$59,VLOOKUP(C134,'Załącznik 13-F.O. Zad 11-15 '!$C$52:$G$174,5,0),0)","v":0},1,0,null,0,1,0,0,0,null,0]
[null,114,"Reklamówki foliowe 9 micronów 210 + 2 x 60 x 435 mm (+/-12), 150 sztuk","Reklamówki o wymiarach 210 + 2 x 60 x 435 mm (+/-12) Nawój: 150 sztuk\nFolia HDPE / grubość 9 mikronówJednostka sprzedaży: 1 rolka (150sztuk)\n","op. (150 szt.)",{"$f":"IF('Załącznik 13-F.O. Zad 11-15 '!$V$59,VLOOKUP(C135,'Załącznik 13-F.O. Zad 11-15 '!$C$52:$G$174,5,0),0)","v":0},29,0,null,0,29,0,0,0,null,0]
[null,115,"Worki do segregacji 60 l, niebieskie na papier, 60 x 72 cm","Wytrzymałe worki ułatwiające segregację śmieci dzięki kodowi kolorystycznemu, Mają nadruk informujący, jakie typy odpadów należy do nich wrzucać, a jakich nie należy, Wymiary: 60 x 72 cm","op. (10 worków)",{"$f":"IF('Załącznik 13-F.O. Zad 11-15 '!$V$59,VLOOKUP(C136,'Załącznik 13-F.O. Zad 11-15 '!$C$52:$G$174,5,0),0)","v":0},55,0,null,0,10,0,15,0,30,0]
[null,116,"Worki do segregacji 60 l, zielone na szkło, 60 x 72 cm","Wytrzymałe worki ułatwiające segregację śmieci dzięki kodowi kolorystycznemu, Mają nadruk informujący, jakie typy odpadów należy do nich wrzucać, a jakich nie należy, Wymiary: 60 x 72 cm","op. (10 worków)",{"$f":"IF('Załącznik 13-F.O. Zad 11-15 '!$V$59,VLOOKUP(C137,'Załącznik 13-F.O. Zad 11-15 '!$C$52:$G$174,5,0),0)","v":0},31,0,null,0,1,0,0,0,30,0]
[null,117,"Worki do segregacji 60 l, zółte na plastik, 60 x 72 cm","Wytrzymałe worki ułatwiające segregację śmieci dzięki kodowi kolorystycznemu, Mają nadruk informujący, jakie typy odpadów należy do nich wrzucać, a jakich nie należy, Wymiary: 60 x 72 cm","op. (10 worków)",{"$f":"IF('Załącznik 13-F.O. Zad 11-15 '!$V$59,VLOOKUP(C138,'Załącznik 13-F.O. Zad 11-15 '!$C$52:$G$174,5,0),0)","v":0},31,0,null,0,1,0,0,0,30,0]
[null,118,"Worki na śmieci LDPE sanitarne 120 l, niebieskie, 10 sztuk","Wymiary: 110 x 70 cm, Grubość: folii: 0,03 mm","op (10 szt)",{"$f":"IF('Załącznik 13-F.O. Zad 11-15 '!$V$59,VLOOKUP(C139,'Załącznik 13-F.O. Zad 11-15 '!$C$52:$G$174,5,0),0)","v":0},35,0,null,0,5,0,0,0,30,0]
[null,119,"Worki na śmieci LDPE sanitarne 160 l, czarne, 20 sztuk","Worki na śmieci LDPE sanitarne 160 l, czarne, 20 sztuk Pojemność: 160 l Wymiary: 150 x 90 cm Grubość: folii: 0,027 mm Kolor folii: czarny Jednostka sprzedaży: 1 opakowanie (20 sztuk)","op. (20 sztuk)",{"$f":"IF('Załącznik 13-F.O. Zad 11-15 '!$V$59,VLOOKUP(C140,'Załącznik 13-F.O. Zad 11-15 '!$C$52:$G$174,5,0),0)","v":0},25,0,null,0,5,0,0,0,20,0]
[null,120,"Worki na śmieci LDPE z taśmą ściągającą 60 l, czarne, 10 sztuk","Posiadają taśmę ściągającą Pojemność: 60 l Wymiary: 72 x 60 cm Grubość: folii: 0,02 mm Kolor folii: czarny Jednostka sprzedaży: 1 opakowanie (10 sztuk)","op. (10 sztuk)",{"$f":"IF('Załącznik 13-F.O. Zad 11-15 '!$V$59,VLOOKUP(C141,'Załącznik 13-F.O. Zad 11-15 '!$C$52:$G$174,5,0),0)","v":0},11,0,null,0,1,0,10,0,null,0]
[null,121,"Worki na śmieci łazienkowe, 20 l, białe, 40 sztuk","Idealne worki na odpady łazienkowe, Pojemność: 20 l, Kolor: biały, Rozmiar: 40 x 50 cm","op: (40 sztuk)",{"$f":"IF('Załącznik 13-F.O. Zad 11-15 '!$V$59,VLOOKUP(C142,'Załącznik 13-F.O. Zad 11-15 '!$C$52:$G$174,5,0),0)","v":0},1,0,null,0,1,0,0,0,null,0]
[null,122,"Worki na śmieci MDPE 35 l, niebieskie 20 sztuk","Pojemność: 35 l Wymiary: 58 x 49 cm Grubość: folii: 0,011 mm Kolor folii: niebieski Jednostka sprzedaży: 1 opakowanie (20 sztuk)","op. (20 sztuk)",{"$f":"IF('Załącznik 13-F.O. Zad 11-15 '!$V$59,VLOOKUP(C143,'Załącznik 13-F.O. Zad 11-15 '!$C$52:$G$174,5,0),0)","v":0},32,0,null,0,2,0,0,0,30,0]
[null,null,null,null,null,null,{"$f":"SUM(G22:G143)","v":2240},null,{"$f":"SUM(I22:I143)","v":18},null,{"$f":"SUM(K22:K143)","v":282},null,{"$f":"SUM(M22:M143)","v":1349},null,{"$f":"SUM(O22:O143)","v":591}]
[null,null,null,null,null,null,null,null,"ŁĄCZNA CENA NETTO DLA ENEA Centrum Sp. z o.o. ",{"$f":"SUM(J22:J143)","v":0},"ŁĄCZNA CENA NETTO DLA ENEA Bioenergia sp. z o.o.",{"$f":"SUM(L22:L143)","v":0},"ŁĄCZNA CENA NETTO DLA ENEA Elektrownia Połaniec sp. z.o.o.",{"$f":"SUM(N22:N143)","v":0},"ŁĄCZNA CENA NETTO DLA ENEA Połaniec Serwis Sp. z o.o.",{"$f":"SUM(P22:P143)","v":0}]
[]
[]
[]
[]
[null,null,"miejscowość i data",null,null,"Pieczęć imienna i podpis przedstawiciela(i) Wykonawcy"]

{"sheet":"zad1","index":10,"n_rows":13,"n_cols":10,"rows_kept":13,"cut":false,"hidden":true,"merged":[[0,6,0,7]]}
[{"$f":"'Załącznik 13-F.O. Zad 11-15 '!D19","v":"Wykonawca nie składa oferty"},null,null,null,null,null,"jeżeli \"naście\""]
[null,null,"0-5","6-9","0-5","6-9","0-5","6-9","dodatek","sumuj te ciągi"]
[{"$f":"INT(A$1/10000000)","v":{"$error":"#VALUE!"}},null,{"$f":"IF(AND(A3>=0,A3<=5),1,0)","v":{"$error":"#VALUE!"}},{"$f":"IF(AND(A3>=6,A3<=9),1,0)","v":{"$error":"#VALUE!"}},{"$f":"IF(A3=0,\"\",IF(A3=1,IF(A4=0,\"dziesięć milionów \",\"\"),IF(A3=2,\"dwadzieścia \",IF(A3=3,\"trzydzieści \",IF(A3=4,\"czterdzieści \",IF(A3=5,\"pięćdziesiąt \",\"\"))))))","v":{"$error":"#VALUE!"}},{"$f":"IF(A3=6,\"sześćdziesiąt \",IF(A3=7,\"siedemdziesiąt \",IF(A3=8,\"osiemdziesiąt \",IF(A3=9,\"dziewięćdziesiąt \",\"\"))))","v":{"$error":"#VALUE!"}},null,null,null,{"$f":"IF(C3,E3&I3,IF(D3,F3&I3,\"\"))","v":{"$error":"#VALUE!"}}]
[{"$f":"INT(A$1/1000000)-A3*10","v":{"$error":"#VALUE!"}},null,{"$error":"#VALUE!"},{"$error":"#VALUE!"},{"$f":"IF(A4=0,IF(AND(A3<>0,A3<>1),\"milionów \",\"\"),IF(A4=1,IF(A3=0,\"jeden milion \",\"jeden milionów \"),IF(A4=2,\"dwa miliony \",IF(A4=3,\"trzy miliony \",IF(A4=4,\"cztery miliony \",IF(A4=5,\"pięć milionów \",\"\"))))))","v":{"$error":"#VALUE!"}},{"$f":"IF(A4=6,\"sześć milionów \",IF(A4=7,\"siedem milionów \",IF(A4=8,\"osiem milionów \",IF(A4=9,\"dziewięć milionów \",\"\"))))","v":{"$error":"#VALUE!"}},{"$f":"IF(A4=0,\"\",IF(A4=1,\"jedenaście milionów \",IF(A4=2,\"dwanaście milionów \",IF(A4=3,\"trzynaście milionów \",IF(A4=4,\"czternaście milionów \",IF(A4=5,\"piętnaście milionów \",\"\"))))))","v":{"$error":"#VALUE!"}},{"$f":"IF(A4=6,\"szesnaście milionów \",IF(A4=7,\"siedemnaście milionów \",IF(A4=8,\"osiemnaście milionów \",IF(A4=9,\"dziewiętnaście milionów \",\"\"))))","v":{"$error":"#VALUE!"}},null,{"$f":"IF(A3=1,IF(C4,G4,IF(D4,H4)),IF(C4,E4,IF(D4,F4,\"\")))","v":{"$error":"#VALUE!"}}]
[{"$f":"INT(A$1/100000)-10*A4-100*A3","v":{"$error":"#VALUE!"}},null,{"$error":"#VALUE!"},{"$error":"#VALUE!"},{"$f":"IF(A5=0,\"\",IF(A5=1,\"sto \",IF(A5=2,\"dwieście \",IF(A5=3,\"trzysta \",IF(A5=4,\"czterysta \",IF(A5=5,\"pięćset \",\"\"))))))","v":{"$error":"#VALUE!"}},{"$f":"IF(A5=6,\"sześćset \",IF(A5=7,\"siedemset \",IF(A5=8,\"osiemset \",IF(A5=9,\"dziewięćset \",\"\"))))","v":{"$error":"#VALUE!"}},null,null,null,{"$f":"IF(C5,E5&I5,IF(D5,F5&I5,\"\"))","v":{"$error":"#VALUE!"}}]
[{"$f":"INT(A$1/10000)-10*A5-100*A4-1000*A3","v":{"$error":"#VALUE!"}},null,{"$error":"#VALUE!"},{"$error":"#VALUE!"},{"$f":"IF(A6=0,\"\",IF(A6=1,IF(A7=0,\"dziesięć tysięcy \",\"\"),IF(A6=2,\"dwadzieścia \",IF(A6=3,\"trzydzieści \",IF(A6=4,\"czterdzieści \",IF(A6=5,\"pięćdziesiąt \",\"\"))))))","v":{"$error":"#VALUE!"}},{"$f":"IF(A6=6,\"sześćdziesiąt \",IF(A6=7,\"siedemdziesiąt \",IF(A6=8,\"osiemdziesiąt \",IF(A6=9,\"dziewięćdziesiąt \",\"\"))))","v":{"$error":"#VALUE!"}},null,null,null,{"$f":"IF(C6,E6&I6,IF(D6,F6&I6,\"\"))","v":{"$error":"#VALUE!"}}]
[{"$f":"INT(A$1/1000)-10*A6-100*A5-1000*A4-10000*A3","v":{"$error":"#VALUE!"}},null,{"$error":"#VALUE!"},{"$error":"#VALUE!"},{"$f":"IF(A7=0,IF(OR(AND(A6<>0,A6<>1),AND(A5<>0,A6=0)),\"tysięcy \",\"\"),IF(A7=1,IF(AND(A5=0,A6=0),\"jeden tysiąc \",\"jeden tysięcy \"),IF(A7=2,\"dwa tysiące \",IF(A7=3,\"trzy tysiące \",IF(A7=4,\"cztery tysiące \",IF(A7=5,\"pięć tysięcy \",\"\"))))))","v":{"$error":"#VALUE!"}},{"$f":"IF(A7=6,\"sześć tysięcy \",IF(A7=7,\"siedem tysięcy \",IF(A7=8,\"osiem tysięcy \",IF(A7=9,\"dziewięć tysięcy \",\"\"))))","v":{"$error":"#VALUE!"}},{"$f":"IF(A7=0,\"\",IF(A7=1,\"jedenaście tysięcy \",IF(A7=2,\"dwanaście tysięcy \",IF(A7=3,\"trzynaście tysięcy \",IF(A7=4,\"czternaście tysięcy \",IF(A7=5,\"piętnaście tysięcy \",\"\"))))))","v":{"$error":"#VALUE!"}},{"$f":"IF(A7=6,\"szesnaście tysięcy \",IF(A7=7,\"siedemnaście tysięcy \",IF(A7=8,\"osiemnaście tysięcy \",IF(A7=9,\"dziewiętnaście tysięcy \",\"\"))))","v":{"$error":"#VALUE!"}},null,{"$f":"IF(A6=1,IF(C7,G7,IF(D7,H7)),IF(C7,E7,IF(D7,F7,\"\")))","v":{"$error":"#VALUE!"}}]
[{"$f":"INT(A$1/100)-10*A7-100*A6-1000*A5-10000*A4-100000*A3","v":{"$error":"#VALUE!"}},null,{"$error":"#VALUE!"},{"$error":"#VALUE!"},{"$f":"IF(A8=0,\"\",IF(A8=1,\"sto \",IF(A8=2,\"dwieście \",IF(A8=3,\"trzysta \",IF(A8=4,\"czterysta \",IF(A8=5,\"pięćset \",\"\"))))))","v":{"$error":"#VALUE!"}},{"$f":"IF(A8=6,\"sześćset \",IF(A8=7,\"siedemset \",IF(A8=8,\"osiemset \",IF(A8=9,\"dziewięćset \",\"\"))))","v":{"$error":"#VALUE!"}},null,null,null,{"$f":"IF(C8,E8&I8,IF(D8,F8&I8,\"\"))","v":{"$error":"#VALUE!"}}]
[{"$f":"INT(A$1/10)-10*A8-100*A7-1000*A6-10000*A5-100000*A4-1000000*A3","v":{"$error":"#VALUE!"}},null,{"$error":"#VALUE!"},{"$error":"#VALUE!"},{"$f":"IF(A9=0,\"\",IF(A9=1,IF(A10=0,\"dziesięć \",\"\"),IF(A9=2,\"dwadzieścia \",IF(A9=3,\"trzydzieści \",IF(A9=4,\"czterdzieści \",IF(A9=5,\"pięćdziesiąt \",\"\"))))))","v":{"$error":"#VALUE!"}},{"$f":"IF(A9=6,\"sześćdziesiąt \",IF(A9=7,\"siedemdziesiąt \",IF(A9=8,\"osiemdziesiąt \",IF(A9=9,\"dziewięćdziesiąt \",\"\"))))","v":{"$error":"#VALUE!"}},null,null,null,{"$f":"IF(C9,E9&I9,IF(D9,F9&I9,\"\"))","v":{"$error":"#VALUE!"}}]
[{"$f":"INT(A$1)-10*A9-100*A8-1000*A7-10000*A6-100000*A5-1000000*A4-10000000*A3","v":{"$error":"#VALUE!"}},null,{"$error":"#VALUE!"},{"$error":"#VALUE!"},{"$f":"IF(A10=0,\"\",IF(A10=1,\"jeden \",IF(A10=2,\"dwa \",IF(A10=3,\"trzy \",IF(A10=4,\"cztery \",IF(A10=5,\"pięć \",\"\"))))))","v":{"$error":"#VALUE!"}},{"$f":"IF(A10=6,\"sześć \",IF(A10=7,\"siedem \",IF(A10=8,\"osiem \",IF(A10=9,\"dziewięć \",\"\"))))","v":{"$error":"#VALUE!"}},{"$f":"IF(A10=0,\"\",IF(A10=1,\"jedenaście \",IF(A10=2,\"dwanaście \",IF(A10=3,\"trzynaście \",IF(A10=4,\"czternaście \",IF(A10=5,\"piętnaście \",\"\"))))))","v":{"$error":"#VALUE!"}},{"$f":"IF(A10=6,\"szesnaście \",IF(A10=7,\"siedemnaście \",IF(A10=8,\"osiemnaście \",IF(A10=9,\"dziewiętnaście \",\"\"))))","v":{"$error":"#VALUE!"}},null,{"$f":"IF(A9=1,IF(C10,G10,IF(D10,H10)),IF(C10,E10,IF(D10,F10,\"\")))","v":{"$error":"#VALUE!"}}]
[{"$f":"ROUND((A1-TRUNC(A1,0))*100,0)","v":{"$error":"#VALUE!"}},null,null,null,null,null,null,null,null,{"$f":"\"zł \"&TEXT(A11,\"00\")&\"/100\"","v":{"$error":"#VALUE!"}}]
[null,null,null,null,"Słownie:"]
[{"$f":"TRUNC(A1,1)","v":{"$error":"#VALUE!"}},null,null,null,{"$f":"J3&J4&J5&J6&J7&J8&J9&J10&J11","v":{"$error":"#VALUE!"}}]

{"sheet":"zad2","index":11,"n_rows":13,"n_cols":10,"rows_kept":13,"cut":false,"hidden":true,"merged":[[0,6,0,7]]}
[{"$f":"'Załącznik 13-F.O. Zad 11-15 '!D22","v":"Wykonawca nie składa oferty"},null,null,null,null,null,"jeżeli \"naście\""]
[null,null,"0-5","6-9","0-5","6-9","0-5","6-9","dodatek","sumuj te ciągi"]
[{"$f":"INT(A$1/10000000)","v":{"$error":"#VALUE!"}},null,{"$f":"IF(AND(A3>=0,A3<=5),1,0)","v":{"$error":"#VALUE!"}},{"$f":"IF(AND(A3>=6,A3<=9),1,0)","v":{"$error":"#VALUE!"}},{"$f":"IF(A3=0,\"\",IF(A3=1,IF(A4=0,\"dziesięć milionów \",\"\"),IF(A3=2,\"dwadzieścia \",IF(A3=3,\"trzydzieści \",IF(A3=4,\"czterdzieści \",IF(A3=5,\"pięćdziesiąt \",\"\"))))))","v":{"$error":"#VALUE!"}},{"$f":"IF(A3=6,\"sześćdziesiąt \",IF(A3=7,\"siedemdziesiąt \",IF(A3=8,\"osiemdziesiąt \",IF(A3=9,\"dziewięćdziesiąt \",\"\"))))","v":{"$error":"#VALUE!"}},null,null,null,{"$f":"IF(C3,E3&I3,IF(D3,F3&I3,\"\"))","v":{"$error":"#VALUE!"}}]
[{"$f":"INT(A$1/1000000)-A3*10","v":{"$error":"#VALUE!"}},null,{"$error":"#VALUE!"},{"$error":"#VALUE!"},{"$f":"IF(A4=0,IF(AND(A3<>0,A3<>1),\"milionów \",\"\"),IF(A4=1,IF(A3=0,\"jeden milion \",\"jeden milionów \"),IF(A4=2,\"dwa miliony \",IF(A4=3,\"trzy miliony \",IF(A4=4,\"cztery miliony \",IF(A4=5,\"pięć milionów \",\"\"))))))","v":{"$error":"#VALUE!"}},{"$f":"IF(A4=6,\"sześć milionów \",IF(A4=7,\"siedem milionów \",IF(A4=8,\"osiem milionów \",IF(A4=9,\"dziewięć milionów \",\"\"))))","v":{"$error":"#VALUE!"}},{"$f":"IF(A4=0,\"\",IF(A4=1,\"jedenaście milionów \",IF(A4=2,\"dwanaście milionów \",IF(A4=3,\"trzynaście milionów \",IF(A4=4,\"czternaście milionów \",IF(A4=5,\"piętnaście milionów \",\"\"))))))","v":{"$error":"#VALUE!"}},{"$f":"IF(A4=6,\"szesnaście milionów \",IF(A4=7,\"siedemnaście milionów \",IF(A4=8,\"osiemnaście milionów \",IF(A4=9,\"dziewiętnaście milionów \",\"\"))))","v":{"$error":"#VALUE!"}},null,{"$f":"IF(A3=1,IF(C4,G4,IF(D4,H4)),IF(C4,E4,IF(D4,F4,\"\")))","v":{"$error":"#VALUE!"}}]
[{"$f":"INT(A$1/100000)-10*A4-100*A3","v":{"$error":"#VALUE!"}},null,{"$error":"#VALUE!"},{"$error":"#VALUE!"},{"$f":"IF(A5=0,\"\",IF(A5=1,\"sto \",IF(A5=2,\"dwieście \",IF(A5=3,\"trzysta \",IF(A5=4,\"czterysta \",IF(A5=5,\"pięćset \",\"\"))))))","v":{"$error":"#VALUE!"}},{"$f":"IF(A5=6,\"sześćset \",IF(A5=7,\"siedemset \",IF(A5=8,\"osiemset \",IF(A5=9,\"dziewięćset \",\"\"))))","v":{"$error":"#VALUE!"}},null,null,null,{"$f":"IF(C5,E5&I5,IF(D5,F5&I5,\"\"))","v":{"$error":"#VALUE!"}}]
[{"$f":"INT(A$1/10000)-10*A5-100*A4-1000*A3","v":{"$error":"#VALUE!"}},null,{"$error":"#VALUE!"},{"$error":"#VALUE!"},{"$f":"IF(A6=0,\"\",IF(A6=1,IF(A7=0,\"dziesięć tysięcy \",\"\"),IF(A6=2,\"dwadzieścia \",IF(A6=3,\"trzydzieści \",IF(A6=4,\"czterdzieści \",IF(A6=5,\"pięćdziesiąt \",\"\"))))))","v":{"$error":"#VALUE!"}},{"$f":"IF(A6=6,\"sześćdziesiąt \",IF(A6=7,\"siedemdziesiąt \",IF(A6=8,\"osiemdziesiąt \",IF(A6=9,\"dziewięćdziesiąt \",\"\"))))","v":{"$error":"#VALUE!"}},null,null,null,{"$f":"IF(C6,E6&I6,IF(D6,F6&I6,\"\"))","v":{"$error":"#VALUE!"}}]
[{"$f":"INT(A$1/1000)-10*A6-100*A5-1000*A4-10000*A3","v":{"$error":"#VALUE!"}},null,{"$error":"#VALUE!"},{"$error":"#VALUE!"},{"$f":"IF(A7=0,IF(OR(AND(A6<>0,A6<>1),AND(A5<>0,A6=0)),\"tysięcy \",\"\"),IF(A7=1,IF(AND(A5=0,A6=0),\"jeden tysiąc \",\"jeden tysięcy \"),IF(A7=2,\"dwa tysiące \",IF(A7=3,\"trzy tysiące \",IF(A7=4,\"cztery tysiące \",IF(A7=5,\"pięć tysięcy \",\"\"))))))","v":{"$error":"#VALUE!"}},{"$f":"IF(A7=6,\"sześć tysięcy \",IF(A7=7,\"siedem tysięcy \",IF(A7=8,\"osiem tysięcy \",IF(A7=9,\"dziewięć tysięcy \",\"\"))))","v":{"$error":"#VALUE!"}},{"$f":"IF(A7=0,\"\",IF(A7=1,\"jedenaście tysięcy \",IF(A7=2,\"dwanaście tysięcy \",IF(A7=3,\"trzynaście tysięcy \",IF(A7=4,\"czternaście tysięcy \",IF(A7=5,\"piętnaście tysięcy \",\"\"))))))","v":{"$error":"#VALUE!"}},{"$f":"IF(A7=6,\"szesnaście tysięcy \",IF(A7=7,\"siedemnaście tysięcy \",IF(A7=8,\"osiemnaście tysięcy \",IF(A7=9,\"dziewiętnaście tysięcy \",\"\"))))","v":{"$error":"#VALUE!"}},null,{"$f":"IF(A6=1,IF(C7,G7,IF(D7,H7)),IF(C7,E7,IF(D7,F7,\"\")))","v":{"$error":"#VALUE!"}}]
[{"$f":"INT(A$1/100)-10*A7-100*A6-1000*A5-10000*A4-100000*A3","v":{"$error":"#VALUE!"}},null,{"$error":"#VALUE!"},{"$error":"#VALUE!"},{"$f":"IF(A8=0,\"\",IF(A8=1,\"sto \",IF(A8=2,\"dwieście \",IF(A8=3,\"trzysta \",IF(A8=4,\"czterysta \",IF(A8=5,\"pięćset \",\"\"))))))","v":{"$error":"#VALUE!"}},{"$f":"IF(A8=6,\"sześćset \",IF(A8=7,\"siedemset \",IF(A8=8,\"osiemset \",IF(A8=9,\"dziewięćset \",\"\"))))","v":{"$error":"#VALUE!"}},null,null,null,{"$f":"IF(C8,E8&I8,IF(D8,F8&I8,\"\"))","v":{"$error":"#VALUE!"}}]
[{"$f":"INT(A$1/10)-10*A8-100*A7-1000*A6-10000*A5-100000*A4-1000000*A3","v":{"$error":"#VALUE!"}},null,{"$error":"#VALUE!"},{"$error":"#VALUE!"},{"$f":"IF(A9=0,\"\",IF(A9=1,IF(A10=0,\"dziesięć \",\"\"),IF(A9=2,\"dwadzieścia \",IF(A9=3,\"trzydzieści \",IF(A9=4,\"czterdzieści \",IF(A9=5,\"pięćdziesiąt \",\"\"))))))","v":{"$error":"#VALUE!"}},{"$f":"IF(A9=6,\"sześćdziesiąt \",IF(A9=7,\"siedemdziesiąt \",IF(A9=8,\"osiemdziesiąt \",IF(A9=9,\"dziewięćdziesiąt \",\"\"))))","v":{"$error":"#VALUE!"}},null,null,null,{"$f":"IF(C9,E9&I9,IF(D9,F9&I9,\"\"))","v":{"$error":"#VALUE!"}}]
[{"$f":"INT(A$1)-10*A9-100*A8-1000*A7-10000*A6-100000*A5-1000000*A4-10000000*A3","v":{"$error":"#VALUE!"}},null,{"$error":"#VALUE!"},{"$error":"#VALUE!"},{"$f":"IF(A10=0,\"\",IF(A10=1,\"jeden \",IF(A10=2,\"dwa \",IF(A10=3,\"trzy \",IF(A10=4,\"cztery \",IF(A10=5,\"pięć \",\"\"))))))","v":{"$error":"#VALUE!"}},{"$f":"IF(A10=6,\"sześć \",IF(A10=7,\"siedem \",IF(A10=8,\"osiem \",IF(A10=9,\"dziewięć \",\"\"))))","v":{"$error":"#VALUE!"}},{"$f":"IF(A10=0,\"\",IF(A10=1,\"jedenaście \",IF(A10=2,\"dwanaście \",IF(A10=3,\"trzynaście \",IF(A10=4,\"czternaście \",IF(A10=5,\"piętnaście \",\"\"))))))","v":{"$error":"#VALUE!"}},{"$f":"IF(A10=6,\"szesnaście \",IF(A10=7,\"siedemnaście \",IF(A10=8,\"osiemnaście \",IF(A10=9,\"dziewiętnaście \",\"\"))))","v":{"$error":"#VALUE!"}},null,{"$f":"IF(A9=1,IF(C10,G10,IF(D10,H10)),IF(C10,E10,IF(D10,F10,\"\")))","v":{"$error":"#VALUE!"}}]
[{"$f":"ROUND((A1-TRUNC(A1,0))*100,0)","v":{"$error":"#VALUE!"}},null,null,null,null,null,null,null,null,{"$f":"\"zł \"&TEXT(A11,\"00\")&\"/100\"","v":{"$error":"#VALUE!"}}]
[null,null,null,null,"Słownie:"]
[{"$f":"TRUNC(A1,1)","v":{"$error":"#VALUE!"}},null,null,null,{"$f":"J3&J4&J5&J6&J7&J8&J9&J10&J11","v":{"$error":"#VALUE!"}}]

{"sheet":"zad3","index":12,"n_rows":13,"n_cols":10,"rows_kept":13,"cut":false,"hidden":true,"merged":[[0,6,0,7]]}
[{"$f":"'Załącznik 13-F.O. Zad 11-15 '!D25","v":"Wykonawca nie składa oferty"},null,null,null,null,null,"jeżeli \"naście\""]
[null,null,"0-5","6-9","0-5","6-9","0-5","6-9","dodatek","sumuj te ciągi"]
[{"$f":"INT(A$1/10000000)","v":{"$error":"#VALUE!"}},null,{"$f":"IF(AND(A3>=0,A3<=5),1,0)","v":{"$error":"#VALUE!"}},{"$f":"IF(AND(A3>=6,A3<=9),1,0)","v":{"$error":"#VALUE!"}},{"$f":"IF(A3=0,\"\",IF(A3=1,IF(A4=0,\"dziesięć milionów \",\"\"),IF(A3=2,\"dwadzieścia \",IF(A3=3,\"trzydzieści \",IF(A3=4,\"czterdzieści \",IF(A3=5,\"pięćdziesiąt \",\"\"))))))","v":{"$error":"#VALUE!"}},{"$f":"IF(A3=6,\"sześćdziesiąt \",IF(A3=7,\"siedemdziesiąt \",IF(A3=8,\"osiemdziesiąt \",IF(A3=9,\"dziewięćdziesiąt \",\"\"))))","v":{"$error":"#VALUE!"}},null,null,null,{"$f":"IF(C3,E3&I3,IF(D3,F3&I3,\"\"))","v":{"$error":"#VALUE!"}}]
[{"$f":"INT(A$1/1000000)-A3*10","v":{"$error":"#VALUE!"}},null,{"$error":"#VALUE!"},{"$error":"#VALUE!"},{"$f":"IF(A4=0,IF(AND(A3<>0,A3<>1),\"milionów \",\"\"),IF(A4=1,IF(A3=0,\"jeden milion \",\"jeden milionów \"),IF(A4=2,\"dwa miliony \",IF(A4=3,\"trzy miliony \",IF(A4=4,\"cztery miliony \",IF(A4=5,\"pięć milionów \",\"\"))))))","v":{"$error":"#VALUE!"}},{"$f":"IF(A4=6,\"sześć milionów \",IF(A4=7,\"siedem milionów \",IF(A4=8,\"osiem milionów \",IF(A4=9,\"dziewięć milionów \",\"\"))))","v":{"$error":"#VALUE!"}},{"$f":"IF(A4=0,\"\",IF(A4=1,\"jedenaście milionów \",IF(A4=2,\"dwanaście milionów \",IF(A4=3,\"trzynaście milionów \",IF(A4=4,\"czternaście milionów \",IF(A4=5,\"piętnaście milionów \",\"\"))))))","v":{"$error":"#VALUE!"}},{"$f":"IF(A4=6,\"szesnaście milionów \",IF(A4=7,\"siedemnaście milionów \",IF(A4=8,\"osiemnaście milionów \",IF(A4=9,\"dziewiętnaście milionów \",\"\"))))","v":{"$error":"#VALUE!"}},null,{"$f":"IF(A3=1,IF(C4,G4,IF(D4,H4)),IF(C4,E4,IF(D4,F4,\"\")))","v":{"$error":"#VALUE!"}}]
[{"$f":"INT(A$1/100000)-10*A4-100*A3","v":{"$error":"#VALUE!"}},null,{"$error":"#VALUE!"},{"$error":"#VALUE!"},{"$f":"IF(A5=0,\"\",IF(A5=1,\"sto \",IF(A5=2,\"dwieście \",IF(A5=3,\"trzysta \",IF(A5=4,\"czterysta \",IF(A5=5,\"pięćset \",\"\"))))))","v":{"$error":"#VALUE!"}},{"$f":"IF(A5=6,\"sześćset \",IF(A5=7,\"siedemset \",IF(A5=8,\"osiemset \",IF(A5=9,\"dziewięćset \",\"\"))))","v":{"$error":"#VALUE!"}},null,null,null,{"$f":"IF(C5,E5&I5,IF(D5,F5&I5,\"\"))","v":{"$error":"#VALUE!"}}]
[{"$f":"INT(A$1/10000)-10*A5-100*A4-1000*A3","v":{"$error":"#VALUE!"}},null,{"$error":"#VALUE!"},{"$error":"#VALUE!"},{"$f":"IF(A6=0,\"\",IF(A6=1,IF(A7=0,\"dziesięć tysięcy \",\"\"),IF(A6=2,\"dwadzieścia \",IF(A6=3,\"trzydzieści \",IF(A6=4,\"czterdzieści \",IF(A6=5,\"pięćdziesiąt \",\"\"))))))","v":{"$error":"#VALUE!"}},{"$f":"IF(A6=6,\"sześćdziesiąt \",IF(A6=7,\"siedemdziesiąt \",IF(A6=8,\"osiemdziesiąt \",IF(A6=9,\"dziewięćdziesiąt \",\"\"))))","v":{"$error":"#VALUE!"}},null,null,null,{"$f":"IF(C6,E6&I6,IF(D6,F6&I6,\"\"))","v":{"$error":"#VALUE!"}}]
[{"$f":"INT(A$1/1000)-10*A6-100*A5-1000*A4-10000*A3","v":{"$error":"#VALUE!"}},null,{"$error":"#VALUE!"},{"$error":"#VALUE!"},{"$f":"IF(A7=0,IF(OR(AND(A6<>0,A6<>1),AND(A5<>0,A6=0)),\"tysięcy \",\"\"),IF(A7=1,IF(AND(A5=0,A6=0),\"jeden tysiąc \",\"jeden tysięcy \"),IF(A7=2,\"dwa tysiące \",IF(A7=3,\"trzy tysiące \",IF(A7=4,\"cztery tysiące \",IF(A7=5,\"pięć tysięcy \",\"\"))))))","v":{"$error":"#VALUE!"}},{"$f":"IF(A7=6,\"sześć tysięcy \",IF(A7=7,\"siedem tysięcy \",IF(A7=8,\"osiem tysięcy \",IF(A7=9,\"dziewięć tysięcy \",\"\"))))","v":{"$error":"#VALUE!"}},{"$f":"IF(A7=0,\"\",IF(A7=1,\"jedenaście tysięcy \",IF(A7=2,\"dwanaście tysięcy \",IF(A7=3,\"trzynaście tysięcy \",IF(A7=4,\"czternaście tysięcy \",IF(A7=5,\"piętnaście tysięcy \",\"\"))))))","v":{"$error":"#VALUE!"}},{"$f":"IF(A7=6,\"szesnaście tysięcy \",IF(A7=7,\"siedemnaście tysięcy \",IF(A7=8,\"osiemnaście tysięcy \",IF(A7=9,\"dziewiętnaście tysięcy \",\"\"))))","v":{"$error":"#VALUE!"}},null,{"$f":"IF(A6=1,IF(C7,G7,IF(D7,H7)),IF(C7,E7,IF(D7,F7,\"\")))","v":{"$error":"#VALUE!"}}]
[{"$f":"INT(A$1/100)-10*A7-100*A6-1000*A5-10000*A4-100000*A3","v":{"$error":"#VALUE!"}},null,{"$error":"#VALUE!"},{"$error":"#VALUE!"},{"$f":"IF(A8=0,\"\",IF(A8=1,\"sto \",IF(A8=2,\"dwieście \",IF(A8=3,\"trzysta \",IF(A8=4,\"czterysta \",IF(A8=5,\"pięćset \",\"\"))))))","v":{"$error":"#VALUE!"}},{"$f":"IF(A8=6,\"sześćset \",IF(A8=7,\"siedemset \",IF(A8=8,\"osiemset \",IF(A8=9,\"dziewięćset \",\"\"))))","v":{"$error":"#VALUE!"}},null,null,null,{"$f":"IF(C8,E8&I8,IF(D8,F8&I8,\"\"))","v":{"$error":"#VALUE!"}}]
[{"$f":"INT(A$1/10)-10*A8-100*A7-1000*A6-10000*A5-100000*A4-1000000*A3","v":{"$error":"#VALUE!"}},null,{"$error":"#VALUE!"},{"$error":"#VALUE!"},{"$f":"IF(A9=0,\"\",IF(A9=1,IF(A10=0,\"dziesięć \",\"\"),IF(A9=2,\"dwadzieścia \",IF(A9=3,\"trzydzieści \",IF(A9=4,\"czterdzieści \",IF(A9=5,\"pięćdziesiąt \",\"\"))))))","v":{"$error":"#VALUE!"}},{"$f":"IF(A9=6,\"sześćdziesiąt \",IF(A9=7,\"siedemdziesiąt \",IF(A9=8,\"osiemdziesiąt \",IF(A9=9,\"dziewięćdziesiąt \",\"\"))))","v":{"$error":"#VALUE!"}},null,null,null,{"$f":"IF(C9,E9&I9,IF(D9,F9&I9,\"\"))","v":{"$error":"#VALUE!"}}]
[{"$f":"INT(A$1)-10*A9-100*A8-1000*A7-10000*A6-100000*A5-1000000*A4-10000000*A3","v":{"$error":"#VALUE!"}},null,{"$error":"#VALUE!"},{"$error":"#VALUE!"},{"$f":"IF(A10=0,\"\",IF(A10=1,\"jeden \",IF(A10=2,\"dwa \",IF(A10=3,\"trzy \",IF(A10=4,\"cztery \",IF(A10=5,\"pięć \",\"\"))))))","v":{"$error":"#VALUE!"}},{"$f":"IF(A10=6,\"sześć \",IF(A10=7,\"siedem \",IF(A10=8,\"osiem \",IF(A10=9,\"dziewięć \",\"\"))))","v":{"$error":"#VALUE!"}},{"$f":"IF(A10=0,\"\",IF(A10=1,\"jedenaście \",IF(A10=2,\"dwanaście \",IF(A10=3,\"trzynaście \",IF(A10=4,\"czternaście \",IF(A10=5,\"piętnaście \",\"\"))))))","v":{"$error":"#VALUE!"}},{"$f":"IF(A10=6,\"szesnaście \",IF(A10=7,\"siedemnaście \",IF(A10=8,\"osiemnaście \",IF(A10=9,\"dziewiętnaście \",\"\"))))","v":{"$error":"#VALUE!"}},null,{"$f":"IF(A9=1,IF(C10,G10,IF(D10,H10)),IF(C10,E10,IF(D10,F10,\"\")))","v":{"$error":"#VALUE!"}}]
[{"$f":"ROUND((A1-TRUNC(A1,0))*100,0)","v":{"$error":"#VALUE!"}},null,null,null,null,null,null,null,null,{"$f":"\"zł \"&TEXT(A11,\"00\")&\"/100\"","v":{"$error":"#VALUE!"}}]
[null,null,null,null,"Słownie:"]
[{"$f":"TRUNC(A1,1)","v":{"$error":"#VALUE!"}},null,null,null,{"$f":"J3&J4&J5&J6&J7&J8&J9&J10&J11","v":{"$error":"#VALUE!"}}]

{"sheet":"zad4","index":13,"n_rows":13,"n_cols":10,"rows_kept":13,"cut":false,"hidden":true,"merged":[[0,6,0,7]]}
[{"$f":"'Załącznik 13-F.O. Zad 11-15 '!D28","v":"Wykonawca nie składa oferty"},null,null,null,null,null,"jeżeli \"naście\""]
[null,null,"0-5","6-9","0-5","6-9","0-5","6-9","dodatek","sumuj te ciągi"]
[{"$f":"INT(A$1/10000000)","v":{"$error":"#VALUE!"}},null,{"$f":"IF(AND(A3>=0,A3<=5),1,0)","v":{"$error":"#VALUE!"}},{"$f":"IF(AND(A3>=6,A3<=9),1,0)","v":{"$error":"#VALUE!"}},{"$f":"IF(A3=0,\"\",IF(A3=1,IF(A4=0,\"dziesięć milionów \",\"\"),IF(A3=2,\"dwadzieścia \",IF(A3=3,\"trzydzieści \",IF(A3=4,\"czterdzieści \",IF(A3=5,\"pięćdziesiąt \",\"\"))))))","v":{"$error":"#VALUE!"}},{"$f":"IF(A3=6,\"sześćdziesiąt \",IF(A3=7,\"siedemdziesiąt \",IF(A3=8,\"osiemdziesiąt \",IF(A3=9,\"dziewięćdziesiąt \",\"\"))))","v":{"$error":"#VALUE!"}},null,null,null,{"$f":"IF(C3,E3&I3,IF(D3,F3&I3,\"\"))","v":{"$error":"#VALUE!"}}]
[{"$f":"INT(A$1/1000000)-A3*10","v":{"$error":"#VALUE!"}},null,{"$error":"#VALUE!"},{"$error":"#VALUE!"},{"$f":"IF(A4=0,IF(AND(A3<>0,A3<>1),\"milionów \",\"\"),IF(A4=1,IF(A3=0,\"jeden milion \",\"jeden milionów \"),IF(A4=2,\"dwa miliony \",IF(A4=3,\"trzy miliony \",IF(A4=4,\"cztery miliony \",IF(A4=5,\"pięć milionów \",\"\"))))))","v":{"$error":"#VALUE!"}},{"$f":"IF(A4=6,\"sześć milionów \",IF(A4=7,\"siedem milionów \",IF(A4=8,\"osiem milionów \",IF(A4=9,\"dziewięć milionów \",\"\"))))","v":{"$error":"#VALUE!"}},{"$f":"IF(A4=0,\"\",IF(A4=1,\"jedenaście milionów \",IF(A4=2,\"dwanaście milionów \",IF(A4=3,\"trzynaście milionów \",IF(A4=4,\"czternaście milionów \",IF(A4=5,\"piętnaście milionów \",\"\"))))))","v":{"$error":"#VALUE!"}},{"$f":"IF(A4=6,\"szesnaście milionów \",IF(A4=7,\"siedemnaście milionów \",IF(A4=8,\"osiemnaście milionów \",IF(A4=9,\"dziewiętnaście milionów \",\"\"))))","v":{"$error":"#VALUE!"}},null,{"$f":"IF(A3=1,IF(C4,G4,IF(D4,H4)),IF(C4,E4,IF(D4,F4,\"\")))","v":{"$error":"#VALUE!"}}]
[{"$f":"INT(A$1/100000)-10*A4-100*A3","v":{"$error":"#VALUE!"}},null,{"$error":"#VALUE!"},{"$error":"#VALUE!"},{"$f":"IF(A5=0,\"\",IF(A5=1,\"sto \",IF(A5=2,\"dwieście \",IF(A5=3,\"trzysta \",IF(A5=4,\"czterysta \",IF(A5=5,\"pięćset \",\"\"))))))","v":{"$error":"#VALUE!"}},{"$f":"IF(A5=6,\"sześćset \",IF(A5=7,\"siedemset \",IF(A5=8,\"osiemset \",IF(A5=9,\"dziewięćset \",\"\"))))","v":{"$error":"#VALUE!"}},null,null,null,{"$f":"IF(C5,E5&I5,IF(D5,F5&I5,\"\"))","v":{"$error":"#VALUE!"}}]
[{"$f":"INT(A$1/10000)-10*A5-100*A4-1000*A3","v":{"$error":"#VALUE!"}},null,{"$error":"#VALUE!"},{"$error":"#VALUE!"},{"$f":"IF(A6=0,\"\",IF(A6=1,IF(A7=0,\"dziesięć tysięcy \",\"\"),IF(A6=2,\"dwadzieścia \",IF(A6=3,\"trzydzieści \",IF(A6=4,\"czterdzieści \",IF(A6=5,\"pięćdziesiąt \",\"\"))))))","v":{"$error":"#VALUE!"}},{"$f":"IF(A6=6,\"sześćdziesiąt \",IF(A6=7,\"siedemdziesiąt \",IF(A6=8,\"osiemdziesiąt \",IF(A6=9,\"dziewięćdziesiąt \",\"\"))))","v":{"$error":"#VALUE!"}},null,null,null,{"$f":"IF(C6,E6&I6,IF(D6,F6&I6,\"\"))","v":{"$error":"#VALUE!"}}]
[{"$f":"INT(A$1/1000)-10*A6-100*A5-1000*A4-10000*A3","v":{"$error":"#VALUE!"}},null,{"$error":"#VALUE!"},{"$error":"#VALUE!"},{"$f":"IF(A7=0,IF(OR(AND(A6<>0,A6<>1),AND(A5<>0,A6=0)),\"tysięcy \",\"\"),IF(A7=1,IF(AND(A5=0,A6=0),\"jeden tysiąc \",\"jeden tysięcy \"),IF(A7=2,\"dwa tysiące \",IF(A7=3,\"trzy tysiące \",IF(A7=4,\"cztery tysiące \",IF(A7=5,\"pięć tysięcy \",\"\"))))))","v":{"$error":"#VALUE!"}},{"$f":"IF(A7=6,\"sześć tysięcy \",IF(A7=7,\"siedem tysięcy \",IF(A7=8,\"osiem tysięcy \",IF(A7=9,\"dziewięć tysięcy \",\"\"))))","v":{"$error":"#VALUE!"}},{"$f":"IF(A7=0,\"\",IF(A7=1,\"jedenaście tysięcy \",IF(A7=2,\"dwanaście tysięcy \",IF(A7=3,\"trzynaście tysięcy \",IF(A7=4,\"czternaście tysięcy \",IF(A7=5,\"piętnaście tysięcy \",\"\"))))))","v":{"$error":"#VALUE!"}},{"$f":"IF(A7=6,\"szesnaście tysięcy \",IF(A7=7,\"siedemnaście tysięcy \",IF(A7=8,\"osiemnaście tysięcy \",IF(A7=9,\"dziewiętnaście tysięcy \",\"\"))))","v":{"$error":"#VALUE!"}},null,{"$f":"IF(A6=1,IF(C7,G7,IF(D7,H7)),IF(C7,E7,IF(D7,F7,\"\")))","v":{"$error":"#VALUE!"}}]
[{"$f":"INT(A$1/100)-10*A7-100*A6-1000*A5-10000*A4-100000*A3","v":{"$error":"#VALUE!"}},null,{"$error":"#VALUE!"},{"$error":"#VALUE!"},{"$f":"IF(A8=0,\"\",IF(A8=1,\"sto \",IF(A8=2,\"dwieście \",IF(A8=3,\"trzysta \",IF(A8=4,\"czterysta \",IF(A8=5,\"pięćset \",\"\"))))))","v":{"$error":"#VALUE!"}},{"$f":"IF(A8=6,\"sześćset \",IF(A8=7,\"siedemset \",IF(A8=8,\"osiemset \",IF(A8=9,\"dziewięćset \",\"\"))))","v":{"$error":"#VALUE!"}},null,null,null,{"$f":"IF(C8,E8&I8,IF(D8,F8&I8,\"\"))","v":{"$error":"#VALUE!"}}]
[{"$f":"INT(A$1/10)-10*A8-100*A7-1000*A6-10000*A5-100000*A4-1000000*A3","v":{"$error":"#VALUE!"}},null,{"$error":"#VALUE!"},{"$error":"#VALUE!"},{"$f":"IF(A9=0,\"\",IF(A9=1,IF(A10=0,\"dziesięć \",\"\"),IF(A9=2,\"dwadzieścia \",IF(A9=3,\"trzydzieści \",IF(A9=4,\"czterdzieści \",IF(A9=5,\"pięćdziesiąt \",\"\"))))))","v":{"$error":"#VALUE!"}},{"$f":"IF(A9=6,\"sześćdziesiąt \",IF(A9=7,\"siedemdziesiąt \",IF(A9=8,\"osiemdziesiąt \",IF(A9=9,\"dziewięćdziesiąt \",\"\"))))","v":{"$error":"#VALUE!"}},null,null,null,{"$f":"IF(C9,E9&I9,IF(D9,F9&I9,\"\"))","v":{"$error":"#VALUE!"}}]
[{"$f":"INT(A$1)-10*A9-100*A8-1000*A7-10000*A6-100000*A5-1000000*A4-10000000*A3","v":{"$error":"#VALUE!"}},null,{"$error":"#VALUE!"},{"$error":"#VALUE!"},{"$f":"IF(A10=0,\"\",IF(A10=1,\"jeden \",IF(A10=2,\"dwa \",IF(A10=3,\"trzy \",IF(A10=4,\"cztery \",IF(A10=5,\"pięć \",\"\"))))))","v":{"$error":"#VALUE!"}},{"$f":"IF(A10=6,\"sześć \",IF(A10=7,\"siedem \",IF(A10=8,\"osiem \",IF(A10=9,\"dziewięć \",\"\"))))","v":{"$error":"#VALUE!"}},{"$f":"IF(A10=0,\"\",IF(A10=1,\"jedenaście \",IF(A10=2,\"dwanaście \",IF(A10=3,\"trzynaście \",IF(A10=4,\"czternaście \",IF(A10=5,\"piętnaście \",\"\"))))))","v":{"$error":"#VALUE!"}},{"$f":"IF(A10=6,\"szesnaście \",IF(A10=7,\"siedemnaście \",IF(A10=8,\"osiemnaście \",IF(A10=9,\"dziewiętnaście \",\"\"))))","v":{"$error":"#VALUE!"}},null,{"$f":"IF(A9=1,IF(C10,G10,IF(D10,H10)),IF(C10,E10,IF(D10,F10,\"\")))","v":{"$error":"#VALUE!"}}]
[{"$f":"ROUND((A1-TRUNC(A1,0))*100,0)","v":{"$error":"#VALUE!"}},null,null,null,null,null,null,null,null,{"$f":"\"zł \"&TEXT(A11,\"00\")&\"/100\"","v":{"$error":"#VALUE!"}}]
[null,null,null,null,"Słownie:"]
[{"$f":"TRUNC(A1,1)","v":{"$error":"#VALUE!"}},null,null,null,{"$f":"J3&J4&J5&J6&J7&J8&J9&J10&J11","v":{"$error":"#VALUE!"}}]

{"sheet":"zad5","index":14,"n_rows":13,"n_cols":10,"rows_kept":13,"cut":false,"hidden":true,"merged":[[0,6,0,7]]}
[{"$f":"'Załącznik 13-F.O. Zad 11-15 '!D31","v":"Wykonawca nie składa oferty"},null,null,null,null,null,"jeżeli \"naście\""]
[null,null,"0-5","6-9","0-5","6-9","0-5","6-9","dodatek","sumuj te ciągi"]
[{"$f":"INT(A$1/10000000)","v":{"$error":"#VALUE!"}},null,{"$f":"IF(AND(A3>=0,A3<=5),1,0)","v":{"$error":"#VALUE!"}},{"$f":"IF(AND(A3>=6,A3<=9),1,0)","v":{"$error":"#VALUE!"}},{"$f":"IF(A3=0,\"\",IF(A3=1,IF(A4=0,\"dziesięć milionów \",\"\"),IF(A3=2,\"dwadzieścia \",IF(A3=3,\"trzydzieści \",IF(A3=4,\"czterdzieści \",IF(A3=5,\"pięćdziesiąt \",\"\"))))))","v":{"$error":"#VALUE!"}},{"$f":"IF(A3=6,\"sześćdziesiąt \",IF(A3=7,\"siedemdziesiąt \",IF(A3=8,\"osiemdziesiąt \",IF(A3=9,\"dziewięćdziesiąt \",\"\"))))","v":{"$error":"#VALUE!"}},null,null,null,{"$f":"IF(C3,E3&I3,IF(D3,F3&I3,\"\"))","v":{"$error":"#VALUE!"}}]
[{"$f":"INT(A$1/1000000)-A3*10","v":{"$error":"#VALUE!"}},null,{"$error":"#VALUE!"},{"$error":"#VALUE!"},{"$f":"IF(A4=0,IF(AND(A3<>0,A3<>1),\"milionów \",\"\"),IF(A4=1,IF(A3=0,\"jeden milion \",\"jeden milionów \"),IF(A4=2,\"dwa miliony \",IF(A4=3,\"trzy miliony \",IF(A4=4,\"cztery miliony \",IF(A4=5,\"pięć milionów \",\"\"))))))","v":{"$error":"#VALUE!"}},{"$f":"IF(A4=6,\"sześć milionów \",IF(A4=7,\"siedem milionów \",IF(A4=8,\"osiem milionów \",IF(A4=9,\"dziewięć milionów \",\"\"))))","v":{"$error":"#VALUE!"}},{"$f":"IF(A4=0,\"\",IF(A4=1,\"jedenaście milionów \",IF(A4=2,\"dwanaście milionów \",IF(A4=3,\"trzynaście milionów \",IF(A4=4,\"czternaście milionów \",IF(A4=5,\"piętnaście milionów \",\"\"))))))","v":{"$error":"#VALUE!"}},{"$f":"IF(A4=6,\"szesnaście milionów \",IF(A4=7,\"siedemnaście milionów \",IF(A4=8,\"osiemnaście milionów \",IF(A4=9,\"dziewiętnaście milionów \",\"\"))))","v":{"$error":"#VALUE!"}},null,{"$f":"IF(A3=1,IF(C4,G4,IF(D4,H4)),IF(C4,E4,IF(D4,F4,\"\")))","v":{"$error":"#VALUE!"}}]
[{"$f":"INT(A$1/100000)-10*A4-100*A3","v":{"$error":"#VALUE!"}},null,{"$error":"#VALUE!"},{"$error":"#VALUE!"},{"$f":"IF(A5=0,\"\",IF(A5=1,\"sto \",IF(A5=2,\"dwieście \",IF(A5=3,\"trzysta \",IF(A5=4,\"czterysta \",IF(A5=5,\"pięćset \",\"\"))))))","v":{"$error":"#VALUE!"}},{"$f":"IF(A5=6,\"sześćset \",IF(A5=7,\"siedemset \",IF(A5=8,\"osiemset \",IF(A5=9,\"dziewięćset \",\"\"))))","v":{"$error":"#VALUE!"}},null,null,null,{"$f":"IF(C5,E5&I5,IF(D5,F5&I5,\"\"))","v":{"$error":"#VALUE!"}}]
[{"$f":"INT(A$1/10000)-10*A5-100*A4-1000*A3","v":{"$error":"#VALUE!"}},null,{"$error":"#VALUE!"},{"$error":"#VALUE!"},{"$f":"IF(A6=0,\"\",IF(A6=1,IF(A7=0,\"dziesięć tysięcy \",\"\"),IF(A6=2,\"dwadzieścia \",IF(A6=3,\"trzydzieści \",IF(A6=4,\"czterdzieści \",IF(A6=5,\"pięćdziesiąt \",\"\"))))))","v":{"$error":"#VALUE!"}},{"$f":"IF(A6=6,\"sześćdziesiąt \",IF(A6=7,\"siedemdziesiąt \",IF(A6=8,\"osiemdziesiąt \",IF(A6=9,\"dziewięćdziesiąt \",\"\"))))","v":{"$error":"#VALUE!"}},null,null,null,{"$f":"IF(C6,E6&I6,IF(D6,F6&I6,\"\"))","v":{"$error":"#VALUE!"}}]
[{"$f":"INT(A$1/1000)-10*A6-100*A5-1000*A4-10000*A3","v":{"$error":"#VALUE!"}},null,{"$error":"#VALUE!"},{"$error":"#VALUE!"},{"$f":"IF(A7=0,IF(OR(AND(A6<>0,A6<>1),AND(A5<>0,A6=0)),\"tysięcy \",\"\"),IF(A7=1,IF(AND(A5=0,A6=0),\"jeden tysiąc \",\"jeden tysięcy \"),IF(A7=2,\"dwa tysiące \",IF(A7=3,\"trzy tysiące \",IF(A7=4,\"cztery tysiące \",IF(A7=5,\"pięć tysięcy \",\"\"))))))","v":{"$error":"#VALUE!"}},{"$f":"IF(A7=6,\"sześć tysięcy \",IF(A7=7,\"siedem tysięcy \",IF(A7=8,\"osiem tysięcy \",IF(A7=9,\"dziewięć tysięcy \",\"\"))))","v":{"$error":"#VALUE!"}},{"$f":"IF(A7=0,\"\",IF(A7=1,\"jedenaście tysięcy \",IF(A7=2,\"dwanaście tysięcy \",IF(A7=3,\"trzynaście tysięcy \",IF(A7=4,\"czternaście tysięcy \",IF(A7=5,\"piętnaście tysięcy \",\"\"))))))","v":{"$error":"#VALUE!"}},{"$f":"IF(A7=6,\"szesnaście tysięcy \",IF(A7=7,\"siedemnaście tysięcy \",IF(A7=8,\"osiemnaście tysięcy \",IF(A7=9,\"dziewiętnaście tysięcy \",\"\"))))","v":{"$error":"#VALUE!"}},null,{"$f":"IF(A6=1,IF(C7,G7,IF(D7,H7)),IF(C7,E7,IF(D7,F7,\"\")))","v":{"$error":"#VALUE!"}}]
[{"$f":"INT(A$1/100)-10*A7-100*A6-1000*A5-10000*A4-100000*A3","v":{"$error":"#VALUE!"}},null,{"$error":"#VALUE!"},{"$error":"#VALUE!"},{"$f":"IF(A8=0,\"\",IF(A8=1,\"sto \",IF(A8=2,\"dwieście \",IF(A8=3,\"trzysta \",IF(A8=4,\"czterysta \",IF(A8=5,\"pięćset \",\"\"))))))","v":{"$error":"#VALUE!"}},{"$f":"IF(A8=6,\"sześćset \",IF(A8=7,\"siedemset \",IF(A8=8,\"osiemset \",IF(A8=9,\"dziewięćset \",\"\"))))","v":{"$error":"#VALUE!"}},null,null,null,{"$f":"IF(C8,E8&I8,IF(D8,F8&I8,\"\"))","v":{"$error":"#VALUE!"}}]
[{"$f":"INT(A$1/10)-10*A8-100*A7-1000*A6-10000*A5-100000*A4-1000000*A3","v":{"$error":"#VALUE!"}},null,{"$error":"#VALUE!"},{"$error":"#VALUE!"},{"$f":"IF(A9=0,\"\",IF(A9=1,IF(A10=0,\"dziesięć \",\"\"),IF(A9=2,\"dwadzieścia \",IF(A9=3,\"trzydzieści \",IF(A9=4,\"czterdzieści \",IF(A9=5,\"pięćdziesiąt \",\"\"))))))","v":{"$error":"#VALUE!"}},{"$f":"IF(A9=6,\"sześćdziesiąt \",IF(A9=7,\"siedemdziesiąt \",IF(A9=8,\"osiemdziesiąt \",IF(A9=9,\"dziewięćdziesiąt \",\"\"))))","v":{"$error":"#VALUE!"}},null,null,null,{"$f":"IF(C9,E9&I9,IF(D9,F9&I9,\"\"))","v":{"$error":"#VALUE!"}}]
[{"$f":"INT(A$1)-10*A9-100*A8-1000*A7-10000*A6-100000*A5-1000000*A4-10000000*A3","v":{"$error":"#VALUE!"}},null,{"$error":"#VALUE!"},{"$error":"#VALUE!"},{"$f":"IF(A10=0,\"\",IF(A10=1,\"jeden \",IF(A10=2,\"dwa \",IF(A10=3,\"trzy \",IF(A10=4,\"cztery \",IF(A10=5,\"pięć \",\"\"))))))","v":{"$error":"#VALUE!"}},{"$f":"IF(A10=6,\"sześć \",IF(A10=7,\"siedem \",IF(A10=8,\"osiem \",IF(A10=9,\"dziewięć \",\"\"))))","v":{"$error":"#VALUE!"}},{"$f":"IF(A10=0,\"\",IF(A10=1,\"jedenaście \",IF(A10=2,\"dwanaście \",IF(A10=3,\"trzynaście \",IF(A10=4,\"czternaście \",IF(A10=5,\"piętnaście \",\"\"))))))","v":{"$error":"#VALUE!"}},{"$f":"IF(A10=6,\"szesnaście \",IF(A10=7,\"siedemnaście \",IF(A10=8,\"osiemnaście \",IF(A10=9,\"dziewiętnaście \",\"\"))))","v":{"$error":"#VALUE!"}},null,{"$f":"IF(A9=1,IF(C10,G10,IF(D10,H10)),IF(C10,E10,IF(D10,F10,\"\")))","v":{"$error":"#VALUE!"}}]
[{"$f":"ROUND((A1-TRUNC(A1,0))*100,0)","v":{"$error":"#VALUE!"}},null,null,null,null,null,null,null,null,{"$f":"\"zł \"&TEXT(A11,\"00\")&\"/100\"","v":{"$error":"#VALUE!"}}]
[null,null,null,null,"Słownie:"]
[{"$f":"TRUNC(A1,1)","v":{"$error":"#VALUE!"}},null,null,null,{"$f":"J3&J4&J5&J6&J7&J8&J9&J10&J11","v":{"$error":"#VALUE!"}}]

{"sheet":"zad6","index":15,"n_rows":13,"n_cols":10,"rows_kept":13,"cut":false,"hidden":true,"merged":[[0,6,0,7]]}
[{"$f":"'Załącznik 13-F.O. Zad 11-15 '!D34","v":0},null,null,null,null,null,"jeżeli \"naście\""]
[null,null,"0-5","6-9","0-5","6-9","0-5","6-9","dodatek","sumuj te ciągi"]
[{"$f":"INT(A$1/10000000)","v":0},null,{"$f":"IF(AND(A3>=0,A3<=5),1,0)","v":1},{"$f":"IF(AND(A3>=6,A3<=9),1,0)","v":0},{"$f":"IF(A3=0,\"\",IF(A3=1,IF(A4=0,\"dziesięć milionów \",\"\"),IF(A3=2,\"dwadzieścia \",IF(A3=3,\"trzydzieści \",IF(A3=4,\"czterdzieści \",IF(A3=5,\"pięćdziesiąt \",\"\"))))))","v":""},{"$f":"IF(A3=6,\"sześćdziesiąt \",IF(A3=7,\"siedemdziesiąt \",IF(A3=8,\"osiemdziesiąt \",IF(A3=9,\"dziewięćdziesiąt \",\"\"))))","v":""},null,null,null,{"$f":"IF(C3,E3&I3,IF(D3,F3&I3,\"\"))","v":""}]
[{"$f":"INT(A$1/1000000)-A3*10","v":0},null,1,0,{"$f":"IF(A4=0,IF(AND(A3<>0,A3<>1),\"milionów \",\"\"),IF(A4=1,IF(A3=0,\"jeden milion \",\"jeden milionów \"),IF(A4=2,\"dwa miliony \",IF(A4=3,\"trzy miliony \",IF(A4=4,\"cztery miliony \",IF(A4=5,\"pięć milionów \",\"\"))))))","v":""},{"$f":"IF(A4=6,\"sześć milionów \",IF(A4=7,\"siedem milionów \",IF(A4=8,\"osiem milionów \",IF(A4=9,\"dziewięć milionów \",\"\"))))","v":""},{"$f":"IF(A4=0,\"\",IF(A4=1,\"jedenaście milionów \",IF(A4=2,\"dwanaście milionów \",IF(A4=3,\"trzynaście milionów \",IF(A4=4,\"czternaście milionów \",IF(A4=5,\"piętnaście milionów \",\"\"))))))","v":""},{"$f":"IF(A4=6,\"szesnaście milionów \",IF(A4=7,\"siedemnaście milionów \",IF(A4=8,\"osiemnaście milionów \",IF(A4=9,\"dziewiętnaście milionów \",\"\"))))","v":""},null,{"$f":"IF(A3=1,IF(C4,G4,IF(D4,H4)),IF(C4,E4,IF(D4,F4,\"\")))","v":""}]
[{"$f":"INT(A$1/100000)-10*A4-100*A3","v":0},null,1,0,{"$f":"IF(A5=0,\"\",IF(A5=1,\"sto \",IF(A5=2,\"dwieście \",IF(A5=3,\"trzysta \",IF(A5=4,\"czterysta \",IF(A5=5,\"pięćset \",\"\"))))))","v":""},{"$f":"IF(A5=6,\"sześćset \",IF(A5=7,\"siedemset \",IF(A5=8,\"osiemset \",IF(A5=9,\"dziewięćset \",\"\"))))","v":""},null,null,null,{"$f":"IF(C5,E5&I5,IF(D5,F5&I5,\"\"))","v":""}]
[{"$f":"INT(A$1/10000)-10*A5-100*A4-1000*A3","v":0},null,1,0,{"$f":"IF(A6=0,\"\",IF(A6=1,IF(A7=0,\"dziesięć tysięcy \",\"\"),IF(A6=2,\"dwadzieścia \",IF(A6=3,\"trzydzieści \",IF(A6=4,\"czterdzieści \",IF(A6=5,\"pięćdziesiąt \",\"\"))))))","v":""},{"$f":"IF(A6=6,\"sześćdziesiąt \",IF(A6=7,\"siedemdziesiąt \",IF(A6=8,\"osiemdziesiąt \",IF(A6=9,\"dziewięćdziesiąt \",\"\"))))","v":""},null,null,null,{"$f":"IF(C6,E6&I6,IF(D6,F6&I6,\"\"))","v":""}]
[{"$f":"INT(A$1/1000)-10*A6-100*A5-1000*A4-10000*A3","v":0},null,1,0,{"$f":"IF(A7=0,IF(OR(AND(A6<>0,A6<>1),AND(A5<>0,A6=0)),\"tysięcy \",\"\"),IF(A7=1,IF(AND(A5=0,A6=0),\"jeden tysiąc \",\"jeden tysięcy \"),IF(A7=2,\"dwa tysiące \",IF(A7=3,\"trzy tysiące \",IF(A7=4,\"cztery tysiące \",IF(A7=5,\"pięć tysięcy \",\"\"))))))","v":""},{"$f":"IF(A7=6,\"sześć tysięcy \",IF(A7=7,\"siedem tysięcy \",IF(A7=8,\"osiem tysięcy \",IF(A7=9,\"dziewięć tysięcy \",\"\"))))","v":""},{"$f":"IF(A7=0,\"\",IF(A7=1,\"jedenaście tysięcy \",IF(A7=2,\"dwanaście tysięcy \",IF(A7=3,\"trzynaście tysięcy \",IF(A7=4,\"czternaście tysięcy \",IF(A7=5,\"piętnaście tysięcy \",\"\"))))))","v":""},{"$f":"IF(A7=6,\"szesnaście tysięcy \",IF(A7=7,\"siedemnaście tysięcy \",IF(A7=8,\"osiemnaście tysięcy \",IF(A7=9,\"dziewiętnaście tysięcy \",\"\"))))","v":""},null,{"$f":"IF(A6=1,IF(C7,G7,IF(D7,H7)),IF(C7,E7,IF(D7,F7,\"\")))","v":""}]
[{"$f":"INT(A$1/100)-10*A7-100*A6-1000*A5-10000*A4-100000*A3","v":0},null,1,0,{"$f":"IF(A8=0,\"\",IF(A8=1,\"sto \",IF(A8=2,\"dwieście \",IF(A8=3,\"trzysta \",IF(A8=4,\"czterysta \",IF(A8=5,\"pięćset \",\"\"))))))","v":""},{"$f":"IF(A8=6,\"sześćset \",IF(A8=7,\"siedemset \",IF(A8=8,\"osiemset \",IF(A8=9,\"dziewięćset \",\"\"))))","v":""},null,null,null,{"$f":"IF(C8,E8&I8,IF(D8,F8&I8,\"\"))","v":""}]
[{"$f":"INT(A$1/10)-10*A8-100*A7-1000*A6-10000*A5-100000*A4-1000000*A3","v":0},null,1,0,{"$f":"IF(A9=0,\"\",IF(A9=1,IF(A10=0,\"dziesięć \",\"\"),IF(A9=2,\"dwadzieścia \",IF(A9=3,\"trzydzieści \",IF(A9=4,\"czterdzieści \",IF(A9=5,\"pięćdziesiąt \",\"\"))))))","v":""},{"$f":"IF(A9=6,\"sześćdziesiąt \",IF(A9=7,\"siedemdziesiąt \",IF(A9=8,\"osiemdziesiąt \",IF(A9=9,\"dziewięćdziesiąt \",\"\"))))","v":""},null,null,null,{"$f":"IF(C9,E9&I9,IF(D9,F9&I9,\"\"))","v":""}]
[{"$f":"INT(A$1)-10*A9-100*A8-1000*A7-10000*A6-100000*A5-1000000*A4-10000000*A3","v":0},null,1,0,{"$f":"IF(A10=0,\"\",IF(A10=1,\"jeden \",IF(A10=2,\"dwa \",IF(A10=3,\"trzy \",IF(A10=4,\"cztery \",IF(A10=5,\"pięć \",\"\"))))))","v":""},{"$f":"IF(A10=6,\"sześć \",IF(A10=7,\"siedem \",IF(A10=8,\"osiem \",IF(A10=9,\"dziewięć \",\"\"))))","v":""},{"$f":"IF(A10=0,\"\",IF(A10=1,\"jedenaście \",IF(A10=2,\"dwanaście \",IF(A10=3,\"trzynaście \",IF(A10=4,\"czternaście \",IF(A10=5,\"piętnaście \",\"\"))))))","v":""},{"$f":"IF(A10=6,\"szesnaście \",IF(A10=7,\"siedemnaście \",IF(A10=8,\"osiemnaście \",IF(A10=9,\"dziewiętnaście \",\"\"))))","v":""},null,{"$f":"IF(A9=1,IF(C10,G10,IF(D10,H10)),IF(C10,E10,IF(D10,F10,\"\")))","v":""}]
[{"$f":"ROUND((A1-TRUNC(A1,0))*100,0)","v":0},null,null,null,null,null,null,null,null,{"$f":"\"zł \"&TEXT(A11,\"00\")&\"/100\"","v":"zł 00/100"}]
[null,null,null,null,"Słownie:"]
[{"$f":"TRUNC(A1,1)","v":0},null,null,null,{"$f":"J3&J4&J5&J6&J7&J8&J9&J10&J11","v":"zł 00/100"}]

{"sheet":"zad7","index":16,"n_rows":13,"n_cols":10,"rows_kept":13,"cut":false,"hidden":true,"merged":[[0,6,0,7]]}
[{"$f":"'Załącznik 13-F.O. Zad 11-15 '!D37","v":0},null,null,null,null,null,"jeżeli \"naście\""]
[null,null,"0-5","6-9","0-5","6-9","0-5","6-9","dodatek","sumuj te ciągi"]
[{"$f":"INT(A$1/10000000)","v":0},null,{"$f":"IF(AND(A3>=0,A3<=5),1,0)","v":1},{"$f":"IF(AND(A3>=6,A3<=9),1,0)","v":0},{"$f":"IF(A3=0,\"\",IF(A3=1,IF(A4=0,\"dziesięć milionów \",\"\"),IF(A3=2,\"dwadzieścia \",IF(A3=3,\"trzydzieści \",IF(A3=4,\"czterdzieści \",IF(A3=5,\"pięćdziesiąt \",\"\"))))))","v":""},{"$f":"IF(A3=6,\"sześćdziesiąt \",IF(A3=7,\"siedemdziesiąt \",IF(A3=8,\"osiemdziesiąt \",IF(A3=9,\"dziewięćdziesiąt \",\"\"))))","v":""},null,null,null,{"$f":"IF(C3,E3&I3,IF(D3,F3&I3,\"\"))","v":""}]
[{"$f":"INT(A$1/1000000)-A3*10","v":0},null,1,0,{"$f":"IF(A4=0,IF(AND(A3<>0,A3<>1),\"milionów \",\"\"),IF(A4=1,IF(A3=0,\"jeden milion \",\"jeden milionów \"),IF(A4=2,\"dwa miliony \",IF(A4=3,\"trzy miliony \",IF(A4=4,\"cztery miliony \",IF(A4=5,\"pięć milionów \",\"\"))))))","v":""},{"$f":"IF(A4=6,\"sześć milionów \",IF(A4=7,\"siedem milionów \",IF(A4=8,\"osiem milionów \",IF(A4=9,\"dziewięć milionów \",\"\"))))","v":""},{"$f":"IF(A4=0,\"\",IF(A4=1,\"jedenaście milionów \",IF(A4=2,\"dwanaście milionów \",IF(A4=3,\"trzynaście milionów \",IF(A4=4,\"czternaście milionów \",IF(A4=5,\"piętnaście milionów \",\"\"))))))","v":""},{"$f":"IF(A4=6,\"szesnaście milionów \",IF(A4=7,\"siedemnaście milionów \",IF(A4=8,\"osiemnaście milionów \",IF(A4=9,\"dziewiętnaście milionów \",\"\"))))","v":""},null,{"$f":"IF(A3=1,IF(C4,G4,IF(D4,H4)),IF(C4,E4,IF(D4,F4,\"\")))","v":""}]
[{"$f":"INT(A$1/100000)-10*A4-100*A3","v":0},null,1,0,{"$f":"IF(A5=0,\"\",IF(A5=1,\"sto \",IF(A5=2,\"dwieście \",IF(A5=3,\"trzysta \",IF(A5=4,\"czterysta \",IF(A5=5,\"pięćset \",\"\"))))))","v":""},{"$f":"IF(A5=6,\"sześćset \",IF(A5=7,\"siedemset \",IF(A5=8,\"osiemset \",IF(A5=9,\"dziewięćset \",\"\"))))","v":""},null,null,null,{"$f":"IF(C5,E5&I5,IF(D5,F5&I5,\"\"))","v":""}]
[{"$f":"INT(A$1/10000)-10*A5-100*A4-1000*A3","v":0},null,1,0,{"$f":"IF(A6=0,\"\",IF(A6=1,IF(A7=0,\"dziesięć tysięcy \",\"\"),IF(A6=2,\"dwadzieścia \",IF(A6=3,\"trzydzieści \",IF(A6=4,\"czterdzieści \",IF(A6=5,\"pięćdziesiąt \",\"\"))))))","v":""},{"$f":"IF(A6=6,\"sześćdziesiąt \",IF(A6=7,\"siedemdziesiąt \",IF(A6=8,\"osiemdziesiąt \",IF(A6=9,\"dziewięćdziesiąt \",\"\"))))","v":""},null,null,null,{"$f":"IF(C6,E6&I6,IF(D6,F6&I6,\"\"))","v":""}]
[{"$f":"INT(A$1/1000)-10*A6-100*A5-1000*A4-10000*A3","v":0},null,1,0,{"$f":"IF(A7=0,IF(OR(AND(A6<>0,A6<>1),AND(A5<>0,A6=0)),\"tysięcy \",\"\"),IF(A7=1,IF(AND(A5=0,A6=0),\"jeden tysiąc \",\"jeden tysięcy \"),IF(A7=2,\"dwa tysiące \",IF(A7=3,\"trzy tysiące \",IF(A7=4,\"cztery tysiące \",IF(A7=5,\"pięć tysięcy \",\"\"))))))","v":""},{"$f":"IF(A7=6,\"sześć tysięcy \",IF(A7=7,\"siedem tysięcy \",IF(A7=8,\"osiem tysięcy \",IF(A7=9,\"dziewięć tysięcy \",\"\"))))","v":""},{"$f":"IF(A7=0,\"\",IF(A7=1,\"jedenaście tysięcy \",IF(A7=2,\"dwanaście tysięcy \",IF(A7=3,\"trzynaście tysięcy \",IF(A7=4,\"czternaście tysięcy \",IF(A7=5,\"piętnaście tysięcy \",\"\"))))))","v":""},{"$f":"IF(A7=6,\"szesnaście tysięcy \",IF(A7=7,\"siedemnaście tysięcy \",IF(A7=8,\"osiemnaście tysięcy \",IF(A7=9,\"dziewiętnaście tysięcy \",\"\"))))","v":""},null,{"$f":"IF(A6=1,IF(C7,G7,IF(D7,H7)),IF(C7,E7,IF(D7,F7,\"\")))","v":""}]
[{"$f":"INT(A$1/100)-10*A7-100*A6-1000*A5-10000*A4-100000*A3","v":0},null,1,0,{"$f":"IF(A8=0,\"\",IF(A8=1,\"sto \",IF(A8=2,\"dwieście \",IF(A8=3,\"trzysta \",IF(A8=4,\"czterysta \",IF(A8=5,\"pięćset \",\"\"))))))","v":""},{"$f":"IF(A8=6,\"sześćset \",IF(A8=7,\"siedemset \",IF(A8=8,\"osiemset \",IF(A8=9,\"dziewięćset \",\"\"))))","v":""},null,null,null,{"$f":"IF(C8,E8&I8,IF(D8,F8&I8,\"\"))","v":""}]
[{"$f":"INT(A$1/10)-10*A8-100*A7-1000*A6-10000*A5-100000*A4-1000000*A3","v":0},null,1,0,{"$f":"IF(A9=0,\"\",IF(A9=1,IF(A10=0,\"dziesięć \",\"\"),IF(A9=2,\"dwadzieścia \",IF(A9=3,\"trzydzieści \",IF(A9=4,\"czterdzieści \",IF(A9=5,\"pięćdziesiąt \",\"\"))))))","v":""},{"$f":"IF(A9=6,\"sześćdziesiąt \",IF(A9=7,\"siedemdziesiąt \",IF(A9=8,\"osiemdziesiąt \",IF(A9=9,\"dziewięćdziesiąt \",\"\"))))","v":""},null,null,null,{"$f":"IF(C9,E9&I9,IF(D9,F9&I9,\"\"))","v":""}]
[{"$f":"INT(A$1)-10*A9-100*A8-1000*A7-10000*A6-100000*A5-1000000*A4-10000000*A3","v":0},null,1,0,{"$f":"IF(A10=0,\"\",IF(A10=1,\"jeden \",IF(A10=2,\"dwa \",IF(A10=3,\"trzy \",IF(A10=4,\"cztery \",IF(A10=5,\"pięć \",\"\"))))))","v":""},{"$f":"IF(A10=6,\"sześć \",IF(A10=7,\"siedem \",IF(A10=8,\"osiem \",IF(A10=9,\"dziewięć \",\"\"))))","v":""},{"$f":"IF(A10=0,\"\",IF(A10=1,\"jedenaście \",IF(A10=2,\"dwanaście \",IF(A10=3,\"trzynaście \",IF(A10=4,\"czternaście \",IF(A10=5,\"piętnaście \",\"\"))))))","v":""},{"$f":"IF(A10=6,\"szesnaście \",IF(A10=7,\"siedemnaście \",IF(A10=8,\"osiemnaście \",IF(A10=9,\"dziewiętnaście \",\"\"))))","v":""},null,{"$f":"IF(A9=1,IF(C10,G10,IF(D10,H10)),IF(C10,E10,IF(D10,F10,\"\")))","v":""}]
[{"$f":"ROUND((A1-TRUNC(A1,0))*100,0)","v":0},null,null,null,null,null,null,null,null,{"$f":"\"zł \"&TEXT(A11,\"00\")&\"/100\"","v":"zł 00/100"}]
[null,null,null,null,"Słownie:"]
[{"$f":"TRUNC(A1,1)","v":0},null,null,null,{"$f":"J3&J4&J5&J6&J7&J8&J9&J10&J11","v":"zł 00/100"}]